added missing includef or algorithm in error

3 jobs for devel in 55 seconds (queued for 29 seconds)
Status Name Job ID Coverage
  Test
failed test_address #130100
shared-fi

00:00:49

failed test_bare #130099
shared-fi

00:00:42

failed test_undefined #130101
shared-fi

00:00:53

 
Name Stage Failure
failed
test_undefined Test
	 13 - emlabcpp_format (Failed)
Errors while running CTest
make: *** [Makefile:15: exec_test] Error 8
Uploading artifacts for failed job
Uploading artifacts...
build/Testing/*/*.xml: found 1 matching files and directories

Uploading artifacts as "junit" to coordinator... ok
id=130101 responseStatus=201 Created token=dNVBG6CZ
Cleaning up project directory and file based variables
ERROR: Job failed: exit code 1

failed
test_address Test
	 13 - emlabcpp_format (Failed)
Errors while running CTest
make: *** [Makefile:15: exec_test] Error 8
Uploading artifacts for failed job
Uploading artifacts...
build/Testing/*/*.xml: found 1 matching files and directories

Uploading artifacts as "junit" to coordinator... ok
id=130100 responseStatus=201 Created token=KFnNfVwx
Cleaning up project directory and file based variables
ERROR: Job failed: exit code 1

failed
test_bare Test
	 13 - emlabcpp_format (Failed)
Errors while running CTest
make: *** [Makefile:15: exec_test] Error 8
Uploading artifacts for failed job
Uploading artifacts...
build/Testing/*/*.xml: found 1 matching files and directories

Uploading artifacts as "junit" to coordinator... ok
id=130099 responseStatus=201 Created token=yCsYkg8D
Cleaning up project directory and file based variables
ERROR: Job failed: exit code 1