Tests are now conditional

3 jobs for devel in 1 minute and 12 seconds (queued for 12 seconds)
Name Stage Failure
failed
test_undefined Test
	 13 - emlabcpp_format (Failed)
Errors while running CTest
make: *** [Makefile:15: exec_test] Error 8
Uploading artifacts for failed job
Uploading artifacts...
build/Testing/*/*.xml: found 1 matching files and directories

Uploading artifacts as "junit" to coordinator... ok
id=133524 responseStatus=201 Created token=tws7Qy2d
Cleaning up project directory and file based variables
ERROR: Job failed: exit code 1

failed
test_address Test
	 13 - emlabcpp_format (Failed)
Errors while running CTest
make: *** [Makefile:15: exec_test] Error 8
Uploading artifacts for failed job
Uploading artifacts...
build/Testing/*/*.xml: found 1 matching files and directories

Uploading artifacts as "junit" to coordinator... ok
id=133523 responseStatus=201 Created token=waX-PZQa
Cleaning up project directory and file based variables
ERROR: Job failed: exit code 1

failed
test_bare Test
	 13 - emlabcpp_format (Failed)
Errors while running CTest
make: *** [Makefile:15: exec_test] Error 8
Uploading artifacts for failed job
Uploading artifacts...
build/Testing/*/*.xml: found 1 matching files and directories

Uploading artifacts as "junit" to coordinator... ok
id=133522 responseStatus=201 Created token=aPCgWpGQ
Cleaning up project directory and file based variables
ERROR: Job failed: exit code 1