ID,Title,Year,DOI,URL,Country / countries,"Citations
(Scopus)","Type
T=tool, F=exercise format, 
E=exercise instance, O=other",Paper goal,"Format
SW used?
(RQ1)
S = software used for planning/carrying out the exercise, N = no software used, e. g. pen and paper, discussion ","Format Traits: 
Progression
(RQ1)","Format Traits: 
Time
(RQ1)","Format Traits: Location
(RQ1)","Format
Traits: Trainees
(RQ1/2)","Participants
Trainees
(RQ2)","Participants
Instructors/designers
(RQ2)","Exercise development
(RQ3)","Assessment of trainees
(RQ3)","
Exercise evaluation
(RQ3)","Any output usable by other educators?
(RQ4)","Future work
(RQ5)"
1,The cyber scenario modeling and reporting tool (CyberSMART),2009,10.1109/CATCH.2009.46,http://ieeexplore.ieee.org/document/4804460/,USA,3,"T, F",to describe a tool for planing complex functional and tabletop exercises,S - exercise preparation,event-driven,N/A,N/A,N/A,N/A,N/A,"planning conference, HSEEP, SW tool for planning",N/A,N/A,Developed SW not found,Not reported
2,Light weight tabletop exercise for cybersecurity education,2014,10.1515/jhsem-2014-0031,https://www.degruyter.com/document/doi/10.1515/jhsem-2014-0031/html,"Estonia, Finland",10,"F, E (8x)",to describe an exercise format,N,linear,"session within one day (from context, seems like one class)",clasroom,team (ad-hoc),master’s students in a cybersecurity program,university instructors,Incident scenario is developed cooperatively with students. No tool mentioned. ,N/A,Feedback from students after the end of TTX,"List of steps describing how to prepare lighweight TTX, list of most common problems encountered","developing more detailed instructions, creation of set of mock scenarios, formalizing and publishing student feedback"
3,Table-Top Exercises for Emergency Management: Tame Solutions for Wicked Problems,2014,10.1109/HICSS.2014.250,https://ieeexplore.ieee.org/document/6758848,Sweden,8,O (design ideas),"how to incorporate wicked problems into TTX, and proposal of design ideas helping to incorporate more wicked problems into TTX",N,N/A,N/A,N/A,N/A,N/A,N/A,N/A,N/A,N/A,Ideas for incorporating wicked problems into TTXs,"Internet-tool for running TTX, evaluation of proposed design ideas, how are exercises used in recovery phase and if the proposed design ideas are useful in this phase"
4,Understanding collaborative challenges in IT security preparedness exercises,2015,10.1007/978-3-319-18467-8_21,http://link.springer.com/10.1007/978-3-319-18467-8_21,Norway,11,E (3x),to study challenges when performing exercises (case study of observing 3 exercise executions),N,linear,session within one day,on-site,team (from an organizaton),9 + 14 + 12 employees (with various job roles and skills) of 3 national Distribution System Operators (energy sector).,"National authority recommended the scenario (indirect involvement). Paper authors planned the exercise. Some of the involved employees (e.g., managers) acted as facilitators for the team.",Incident scenario was recommended by the national authority. No usage of any special development tools or execution tools was mentioned.,Anecdotal: The team leader / organization manager discussed how well the employees handled the simulated crisis.,"Anecdotal: reflection and discussion after the exercise, but no specific qualitative research method used (e.g., no recording, transcribing, and coding the interviews), just observations of paper authors.",Recommendations for conducting exercises described in text.,1) Study organizations that perform exercises regularly (not for the first time): their best practices and challenges. 2) Study challenges during real-life incident responses to prepare better exercises for the future.
5,"Towards a Successful Exercise Implementation –
A Case Study of Exercise Methodologies",2015,10.1007/978-3-319-20376-8_19,http://link.springer.com/10.1007/978-3-319-20376-8_19,Greece,2,O (review),to review of exercise methodologies w.r.t. the ISO standard 22398,N/A,N/A,N/A,N/A,N/A,N/A,N/A,N/A,N/A,N/A,"ENISA methodology is the most compliant with the ISO 22398 standard, yet not completely.",Add restrictions to exercises which are following implemented security policy.
6,Objective oriented exercise evaluation with TARCK-it,2015,N/A,https://idl.iscram.org/files/astridjanssen/2015/1223_AstridJanssen+HannekeVreugdenhil2015.pdf,Netherlands,1,"O (method), E",to Introduce a method for trainee assessment,S - TARCK-IT for evaluation,probably linear but not explicit,3-day exercise,N/A,team (from an organizaton),employees of Dutch Water Management Centre (WMCN) and Meteorological Institute (KNMI),Dutch Water Management Centre (WMCN) and Meteorological Institute (KNMI),N/A,The main topic of the paper; based on the OODA loop.,N/A,SW TARCK-it not found,Change binary scoring to 4 point scale as sometimes the actions performed by teams are somewhere in between
7,Environment for cybersecurity tabletop exercises,2017,N/A,https://www.researchgate.net/profile/Linas-Bukauskas/publication/320244434_Environment_for_Cybersecurity_Tabletop_Exercises/links/59e1336caca2724cbfdb73a0/Environment-for-Cybersecurity-Tabletop-Exercises.pdf,Lithuania,7,"T, F, E",to present a web-based environment for playing tabletop exercise as a game,S - exercise runtime,linear,session within one day,"SW makes it possible on-site or remote, this exercise seems to be on-site",team (ad-hoc),"IT students and students of International
relationships and political sciences. Total participant count is not given but the text mentions 25 roles from 5 role groups.","The paper says that Moderators set up the game and observed it. It's not explicitly written who the Moderators were, we assume the paper authors.",National legislation defines the player roles. Exercises follow the lifecycle phases defined by ENISA. The scenario events are defined by Moderators using the TTXWE tool.,"Offline comparison to the correct solution is mentioned in the abstract, but no details are given in the paper.","Logging of user actions, then simple summary counts / statistics: 1) how many events were solved, closed, still active, and delegated, 2) how many messages were sent.",SW TTXWE not found. The paper does not include any link to download any materials or a link with demo of the environment.,"Do an exercise with professionals working with real CI, monitor and assess their stress level. Develop stress level management module that would dynamically adapt the game based on how many players are active and how much they exchange messages."
8,Training Cyber Security Exercise Facilitator: Behavior Modeling Based on Human Error,2019,10.1007/978-3-319-94782-2_14,http://link.springer.com/10.1007/978-3-319-94782-2_14,Japan,1,"E, O (study)",to study the errors made by exercise facilitators when interacting with exercise participants,N,probably linear but not explicit,probably one day but not explicit,probably on-site but not explicit,team,ICS security stakeholders,Nagoya Institute of Technology (paper authors or their colleagues?),[Referenced in another paper],"[Not mentioned, the focus of the paper is on facilitators]","Evaluation of the facilitators, not the exercise: audio recording of 4 facilitators, then transcribing to text and performing qualitative analysis.",Not reported,"Not explicit, but at the end the authors say to develop list of learning goals and share the instances of errors among facilitators."
9,Tabletop exercise as a tool to foster resilience in the energy sector: Lessons learned in the baltic states,2020,10.3850/978-981-14-8593-0_4019-cd,https://www.rpsonline.com.sg/proceedings/esrel2020/pdf/4019.pdf,"Italy, Lithuania, USA",0,E,to report takeaways from a particular exercise,N,probably linear but not explicit,probably one day but not explicit,probably on-site but not explicit,team,natural gas supply and energy security stakeholders in the Baltic states (108 participants),NATO Energy Security Centre of Excellence (NATO ENSEC COE) and the European Commission Joint Research Centre (JRC),[Referenced in another paper],Anecdotal: Experts evaluated participants' work and made a survey. No details are given.,Anecdotal: participants shared comments about what they learned.,Recommendations and takeaways for improving security in practice described in text.,Repeat more exercises.
10,Bridging the Cyber Security Skills Gap: Using Tabletop Exercises to Solve the CSSG Crisis,2020,10.1007/978-3-030-61814-8_10,http://link.springer.com/10.1007/978-3-030-61814-8_10,UK,4,O (study),to investigates the current cyber security skills gap and how TTXs can fill it,N/A,N/A,N/A,N/A,N/A,N/A,N/A,N/A,N/A,N/A,Not reported,Not reported
11,Designing Framework for Tabletop Exercise to Promote Resilience Against Cyber Attacks,2022,10.1016/B978-0-323-85159-6.50245-1,https://linkinghub.elsevier.com/retrieve/pii/B9780323851596502451,Japan,0,"F, E",to describe three exercises developed by the authors ,"S - exercise runtime, N, N (3 exercises)",probably linear but not explicit,probably one day but not explicit,probably on-site but not explicit,probably team but not explicit,"ICS stakeholders, over 100 students in exercise 3",Nagoya Institute of Technology (paper authors?),Nagoya Institute of Technology (paper authors?),None,Anecdotal: participants shared comments about what they learned.,Not reported,Develop a method that would demonstrate the risks due to failure to act.
12,Scenario-based incident response training: lessons learnt from conducting an experiential learning virtual incident response tabletop exercise,2023,10.1108/ICS-05-2022-0085,https://www.emerald.com/insight/content/doi/10.1108/ICS-05-2022-0085/full/html,UK,0,"O (review), E",to report experience from a virtual incident response tabletop exercise,S - exercise runtime (MS Teams),linear,session within one day,virtual (remote),team,20 managers and team leaders from across the business organization within the law enforcement industry,N/A (paper authors?),Exercise planning and design: inter-departmental team. ,Not reported,"Survey responses about the content of the exercise. For each question, the number of participants who made that answer is reported. No further analysis is made. Also, anecdotal evidence is reported that the exercise helped increase awareness.",Not reported,"Refine the exercise to incorporate lessons learnt from running the exercise.
Develop a training program for staff at all levels within a business."
13,Criteria for Realistic and Expedient Scenarios for Tabletop Exercises on Cyber Attacks Against Industrial Control Systems in the Petroleum Industry,2023,10.1007/978-981-19-6414-5_3,https://link.springer.com/10.1007/978-981-19-6414-5_3,Norway,0,"O (criteria for expedient and realistic scenarios), F (example scenario topics)",to investigate what are characteristics of a realistic and expedient exercise scenario for industrial control systems,N/A,"linear but not explicit in the paper – extracted from a related master thesis - Seven out of eight scenarios are divided into several parts, which will be presented sequentially during an exercise.",N/A – extracted from a related master thesis - 1-4 hours - The duration vary according to the exercise’s purpose and scope. - Exercise Plan (Table 4.4) a exercise plan (page 78),N/A,N/A - just interviews with two operators (companies) about the prepared scenarios,target audience - oil and gas industry ,N/A,Paper authors.,N/A,"Evaluation of the method, not the exercise. Respondents from two different operator companies have contributed.",8 scenarios in master thesis where all details are available - scenarios description - https://ntnuopen.ntnu.no/ntnu-xmlui/handle/11250/2789416,deploy the scenarios and test criteria in practice
14,AiCEF: an AI-assisted cyber exercise content generation framework using named entity recognition,2023,10.1007/s10207-023-00693-z,https://link.springer.com/10.1007/s10207-023-00693-z,Greece,0,"T,F (method for generating exercise content)",to apply machine learning to unstructured information sources to generate exercise content,S - exercise generation framework,linear,"hours (e.g., 2-4) see exercise requirements and specifications Fig. 10 also see Table 12",All Participants are located in the same or different Locations. The Operational Layer is illustrated in Fig. 2b.,N/A,"N/A - no exercises conducted, only evaluation of generated scenarious by group of experts",N/A,Four exercise planners selected to individually generate a scenario according to the provided high-level exercise requirements and specifications.,N/A,"Evaluation of the method, not the exercise. See Section 5.2 - Scenario content evaluation 16 experts evaluated generated scenarios","described tools for automated generation of structured cyber security exercises scenarios are planned to be released at https://github.com/grazvan/AiCEF, not available yet","for operational usage more cybersecurity-related sources must be parsed, detection of the Cyber Kill Chain phases"
