{"action_log_id": 152, "action_type": "INJECT", "content": "# This is an introductory inject\n\nYou have a few minutes to read this and familiarize yourselves with the platform. Injects like these represent events in the simulated world of this exercise.\n\n## Tools\n\nYou can interact with the world using the tools on the right part of your screen. \n\nFor example, to use a browser, select it from the panel on the very right and enter the required argument, let's say `test.ex`. Once you've done that, click on Submit button to use the simulated browser command. You will get a response.\n       \n## Rules\n* Use only one computer to interact with the exercise.\n* Discuss every action you take with your teammates.\n* Do not try to intentionally \"break\" the exercise. You may damage the experience for the entire group.\n        \n## Limitations\n* You can only send an email to one address at a time. \n* Do not rely on a built-in browser in the platform; instead, use \"Download file\" to view files locally using your browser.\n\nIf you are having trouble with the technical part of the exercise, ask the instructors in person.\n        \nInstructors\n", "sender": "Instructors", "file_name": "", "timestamp": "2023-11-22T14:18:52.665846", "tool_id": null}
{"action_log_id": 177, "action_type": "COMMAND", "content": "**flow_search** _https://nice-project.uni.ex/settings/?email=abuse@freemail.ex_\n\n**response**: Website not found\n", "sender": "", "file_name": "", "timestamp": "2023-11-22T14:28:13.894503", "tool_id": 72}
{"action_log_id": 180, "action_type": "COMMAND", "content": "**block_from** _https://nice-project.uni.ex/_\n\n**response**: Target IP address or email address was not found\n", "sender": "", "file_name": "", "timestamp": "2023-11-22T14:28:29.152861", "tool_id": 73}
{"action_log_id": 183, "action_type": "COMMAND", "content": "**flow_search** _https://nice-project.uni.ex/_\n\n**response**: 198.51.100.15, 198.51.100.69\n", "sender": "", "file_name": "", "timestamp": "2023-11-22T14:28:44.768322", "tool_id": 72}
{"action_log_id": 190, "action_type": "COMMAND", "content": "**mails_received_from** _it_department@mail.ex_\n\n**response**: 1 mail sent to kathy@mail.uni.ex from it_department@mail.ex,\n1 mail sent to lisa.grant@mail.uni.ex from it_department@mail.ex,\n1 mail sent to peter.quinn@mail.uni.ex from it_department@mail.ex\n\n", "sender": "", "file_name": "", "timestamp": "2023-11-22T14:29:49.739365", "tool_id": 71}
{"action_log_id": 207, "action_type": "COMMAND", "content": "**contacts** _nice-project.uni.ex_\n\n**response**: cloud@uni.ex\n", "sender": "", "file_name": "", "timestamp": "2023-11-22T14:31:41.838865", "tool_id": 67}
{"action_log_id": 227, "action_type": "COMMAND", "content": "**browser** _nice-project.uni.ex_\n\n**response**: \n", "sender": "", "file_name": "nice-project-root.png", "timestamp": "2023-11-22T14:34:38.341252", "tool_id": 69}
{"action_log_id": 232, "action_type": "COMMAND", "content": "**browser** _https://nice-project.uni.ex/_\n\n**response**: \n", "sender": "", "file_name": "nice-project-root.png", "timestamp": "2023-11-22T14:34:57.941405", "tool_id": 69}
{"action_log_id": 238, "action_type": "COMMAND", "content": "**mails_received_from** _it_department@mail.ex_\n\n**response**: 1 mail sent to kathy@mail.uni.ex from it_department@mail.ex,\n1 mail sent to lisa.grant@mail.uni.ex from it_department@mail.ex,\n1 mail sent to peter.quinn@mail.uni.ex from it_department@mail.ex\n\n", "sender": "", "file_name": "", "timestamp": "2023-11-22T14:35:41.287912", "tool_id": 71}
{"action_log_id": 241, "action_type": "COMMAND", "content": "**contacts** _it_department@mail.ex_\n\n**response**: Unknown address.\n", "sender": "", "file_name": "", "timestamp": "2023-11-22T14:35:55.330929", "tool_id": 67}
{"action_log_id": 244, "action_type": "COMMAND", "content": "**block_from** _it_department@mail.ex_\n\n**response**: DONE\n", "sender": "", "file_name": "", "timestamp": "2023-11-22T14:36:30.575112", "tool_id": 73}
{"action_log_id": 257, "action_type": "COMMAND", "content": "**DNS lookup** _https://nice-project.uni.ex/_\n\n**response**: 198.51.100.40\n", "sender": "", "file_name": "", "timestamp": "2023-11-22T14:37:33.431222", "tool_id": 68}
{"action_log_id": 258, "action_type": "COMMAND", "content": "**block_from** _198.51.100.40_\n\n**response**: DONE\n", "sender": "", "file_name": "", "timestamp": "2023-11-22T14:37:40.440113", "tool_id": 73}
{"action_log_id": 275, "action_type": "COMMAND", "content": "**flow_search** _198.51.100.40_\n\n**response**: 198.51.100.15, 198.51.100.69\n", "sender": "", "file_name": "", "timestamp": "2023-11-22T14:39:28.864906", "tool_id": 72}
{"action_log_id": 280, "action_type": "COMMAND", "content": "**contacts** _198.51.100.15_\n\n**response**: jane.taylor@mail.uni.ex\n", "sender": "", "file_name": "", "timestamp": "2023-11-22T14:39:58.181523", "tool_id": 67}
{"action_log_id": 281, "action_type": "COMMAND", "content": "**contacts** _198.51.100.69_\n\n**response**: doe@mail.uni.ex\n", "sender": "", "file_name": "", "timestamp": "2023-11-22T14:40:10.840618", "tool_id": 67}
{"action_log_id": 356, "action_type": "COMMAND", "content": "**browser** _https://nice-project.uni.ex/_\n\n**response**: Website unreachable.\n", "sender": "", "file_name": "", "timestamp": "2023-11-22T14:53:17.534975", "tool_id": 69}
{"action_log_id": 369, "action_type": "COMMAND", "content": "**mails_sent_to** _it_department@mail.ex_\n\n**response**: 0 mails sent to it_department@mail.ex.\n", "sender": "", "file_name": "", "timestamp": "2023-11-22T14:55:26.404497", "tool_id": 70}
{"action_log_id": 375, "action_type": "COMMAND", "content": "**mails_received_from** _it_department@mail.ex_\n\n**response**: 1 mail sent to kathy@mail.uni.ex from it_department@mail.ex,\n1 mail sent to lisa.grant@mail.uni.ex from it_department@mail.ex,\n1 mail sent to peter.quinn@mail.uni.ex from it_department@mail.ex\n\n", "sender": "", "file_name": "", "timestamp": "2023-11-22T14:55:45.392560", "tool_id": 71}
{"action_log_id": 380, "action_type": "COMMAND", "content": "**DNS lookup** _https://nice-project.uni.ex/_\n\n**response**: 198.51.100.40\n", "sender": "", "file_name": "", "timestamp": "2023-11-22T14:56:06.197503", "tool_id": 68}
{"action_log_id": 381, "action_type": "COMMAND", "content": "**flow_search** _198.51.100.40_\n\n**response**: 198.51.100.15, 198.51.100.69\n", "sender": "", "file_name": "", "timestamp": "2023-11-22T14:56:14.725059", "tool_id": 72}
{"action_log_id": 437, "action_type": "COMMAND", "content": "**contacts** _203.0.113.46_\n\n**response**: Unknown address.\n", "sender": "", "file_name": "", "timestamp": "2023-11-22T15:04:31.115239", "tool_id": 67}
{"action_log_id": 449, "action_type": "COMMAND", "content": "**DNS lookup** _minas.freemail.ex_\n\n**response**: Website unreachable.\n", "sender": "", "file_name": "", "timestamp": "2023-11-22T15:05:02.945861", "tool_id": 68}
{"action_log_id": 454, "action_type": "COMMAND", "content": "**browser** _uni.ex_\n\n**response**: Website unreachable.\n", "sender": "", "file_name": "", "timestamp": "2023-11-22T15:05:48.699851", "tool_id": 69}
{"action_log_id": 455, "action_type": "COMMAND", "content": "**browser** _https://uni.ex/_\n\n**response**: Website unreachable.\n", "sender": "", "file_name": "", "timestamp": "2023-11-22T15:05:55.839165", "tool_id": 69}
{"action_log_id": 464, "action_type": "COMMAND", "content": "**contacts** _203.0.113.46_\n\n**response**: Unknown address.\n", "sender": "", "file_name": "", "timestamp": "2023-11-22T15:07:18.706836", "tool_id": 67}
{"action_log_id": 465, "action_type": "COMMAND", "content": "**flow_search** _203.0.113.46_\n\n**response**: Website not found\n", "sender": "", "file_name": "", "timestamp": "2023-11-22T15:07:26.573894", "tool_id": 72}
{"action_log_id": 467, "action_type": "COMMAND", "content": "**flow_search** _minas.freemail.ex_\n\n**response**: Website not found\n", "sender": "", "file_name": "", "timestamp": "2023-11-22T15:07:42.055556", "tool_id": 72}
{"action_log_id": 468, "action_type": "COMMAND", "content": "**flow_search** _https://minas.freemail.ex/_\n\n**response**: Website not found\n", "sender": "", "file_name": "", "timestamp": "2023-11-22T15:07:50.844011", "tool_id": 72}
{"action_log_id": 472, "action_type": "COMMAND", "content": "**mails_received_from** _rt@rt.freemail.ex_\n\n**response**: Invalid request, only known e-mail addresses are valid parameters.\n", "sender": "", "file_name": "", "timestamp": "2023-11-22T15:09:12.502381", "tool_id": 71}
{"action_log_id": 476, "action_type": "COMMAND", "content": "**mails_sent_to** _rt@rt.freemail.ex_\n\n**response**: Invalid request, only known e-mail addresses are valid parameters.\n", "sender": "", "file_name": "", "timestamp": "2023-11-22T15:09:34.483313", "tool_id": 70}
{"action_log_id": 512, "action_type": "COMMAND", "content": "**sharing_system** _TLP:RED We have detected a suspicious activity on these addresses 198.51.100.40, it_department@mail.ex, https://nice-project.uni.ex/, we recommend blocking them temporairly if you have received some suspicious logs. We are handling the incident._\n\n**response**: DONE\n", "sender": "", "file_name": "", "timestamp": "2023-11-22T15:20:10.383421", "tool_id": 77}
{"action_log_id": 527, "action_type": "INJECT", "content": "The exercise will conclude in one minute.\n\nInstructors\n", "sender": "Instructors", "file_name": "", "timestamp": "2023-11-22T15:22:53.422604", "tool_id": null}
{"action_log_id": 541, "action_type": "INJECT", "content": "The exercise is over.\n\nInstructors\n", "sender": "Instructors", "file_name": "", "timestamp": "2023-11-22T15:23:55.937575", "tool_id": null}