{"action_log_id": 147, "action_type": "INJECT", "content": "# This is an introductory inject\n\nYou have a few minutes to read this and familiarize yourselves with the platform. Injects like these represent events in the simulated world of this exercise.\n\n## Tools\n\nYou can interact with the world using the tools on the right part of your screen. \n\nFor example, to use a browser, select it from the panel on the very right and enter the required argument, let's say `test.ex`. Once you've done that, click on Submit button to use the simulated browser command. You will get a response.\n       \n## Rules\n* Use only one computer to interact with the exercise.\n* Discuss every action you take with your teammates.\n* Do not try to intentionally \"break\" the exercise. You may damage the experience for the entire group.\n        \n## Limitations\n* You can only send an email to one address at a time. \n* Do not rely on a built-in browser in the platform; instead, use \"Download file\" to view files locally using your browser.\n\nIf you are having trouble with the technical part of the exercise, ask the instructors in person.\n        \nInstructors\n", "sender": "Instructors", "file_name": "", "timestamp": "2023-11-22T14:18:52.461541", "tool_id": null}
{"action_log_id": 184, "action_type": "COMMAND", "content": "**browser** _https://nice-project.uni.ex/settings/?email=abuse@freemail.ex_\n\n**response**: \n", "sender": "", "file_name": "nice-project-form.html", "timestamp": "2023-11-22T14:28:50.594878", "tool_id": 69}
{"action_log_id": 199, "action_type": "COMMAND", "content": "**DNS lookup** _https://nice-project.uni.ex/settings/?email=abuse@freemail.ex_\n\n**response**: Website unreachable.\n", "sender": "", "file_name": "", "timestamp": "2023-11-22T14:30:46.424955", "tool_id": 68}
{"action_log_id": 209, "action_type": "COMMAND", "content": "**DNS lookup** _nice-project.uni.ex_\n\n**response**: 198.51.100.40\n", "sender": "", "file_name": "", "timestamp": "2023-11-22T14:31:49.219123", "tool_id": 68}
{"action_log_id": 214, "action_type": "COMMAND", "content": "**block_from** _198.51.100.40_\n\n**response**: DONE\n", "sender": "", "file_name": "", "timestamp": "2023-11-22T14:33:09.461655", "tool_id": 73}
{"action_log_id": 218, "action_type": "COMMAND", "content": "**browser** _https://nice-project.uni.ex/settings/?email=abuse@freemail.ex_\n\n**response**: Website unreachable.\n", "sender": "", "file_name": "", "timestamp": "2023-11-22T14:33:40.610599", "tool_id": 69}
{"action_log_id": 262, "action_type": "COMMAND", "content": "**flow_search** _nice-project.uni.ex_\n\n**response**: 198.51.100.15, 198.51.100.69\n", "sender": "", "file_name": "", "timestamp": "2023-11-22T14:38:36.795081", "tool_id": 72}
{"action_log_id": 276, "action_type": "COMMAND", "content": "**contacts** _198.51.100.69_\n\n**response**: doe@mail.uni.ex\n", "sender": "", "file_name": "", "timestamp": "2023-11-22T14:39:33.592506", "tool_id": 67}
{"action_log_id": 279, "action_type": "COMMAND", "content": "**contacts** _198.51.100.15_\n\n**response**: jane.taylor@mail.uni.ex\n", "sender": "", "file_name": "", "timestamp": "2023-11-22T14:39:46.020269", "tool_id": 67}
{"action_log_id": 285, "action_type": "COMMAND", "content": "**DNS lookup** _https://nice-project.uni.ex/settings/_\n\n**response**: 198.51.100.40\n", "sender": "", "file_name": "", "timestamp": "2023-11-22T14:40:38.425131", "tool_id": 68}
{"action_log_id": 304, "action_type": "COMMAND", "content": "**mails_received_from** _doe@mail.uni.ex_\n\n**response**: 0 mails sent from doe@mail.uni.ex.\n", "sender": "", "file_name": "", "timestamp": "2023-11-22T14:43:59.949625", "tool_id": 71}
{"action_log_id": 305, "action_type": "COMMAND", "content": "**mails_sent_to** _doe@mail.uni.ex_\n\n**response**: 0 mails sent to doe@mail.uni.ex.\n", "sender": "", "file_name": "", "timestamp": "2023-11-22T14:44:14.447454", "tool_id": 70}
{"action_log_id": 306, "action_type": "COMMAND", "content": "**mails_sent_to** _198.51.100.15_\n\n**response**: Invalid request, only known e-mail addresses are valid parameters.\n", "sender": "", "file_name": "", "timestamp": "2023-11-22T14:44:24.879667", "tool_id": 70}
{"action_log_id": 308, "action_type": "COMMAND", "content": "**mails_sent_to** _jane.taylor@mail.uni.ex_\n\n**response**: 0 mails sent to jane.taylor@mail.uni.ex.\n", "sender": "", "file_name": "", "timestamp": "2023-11-22T14:44:40.084938", "tool_id": 70}
{"action_log_id": 310, "action_type": "COMMAND", "content": "**mails_received_from** _jane.taylor@mail.uni.ex_\n\n**response**: 0 mails sent from jane.taylor@mail.uni.ex.\n", "sender": "", "file_name": "", "timestamp": "2023-11-22T14:44:51.008486", "tool_id": 71}
{"action_log_id": 313, "action_type": "COMMAND", "content": "**mails_received_from** _doe@mail.uni.ex._\n\n**response**: Invalid request, only known e-mail addresses are valid parameters.\n", "sender": "", "file_name": "", "timestamp": "2023-11-22T14:45:22.138535", "tool_id": 71}
{"action_log_id": 315, "action_type": "COMMAND", "content": "**mails_received_from** _doe@mail.uni.ex_\n\n**response**: 0 mails sent from doe@mail.uni.ex.\n", "sender": "", "file_name": "", "timestamp": "2023-11-22T14:45:29.295366", "tool_id": 71}
{"action_log_id": 324, "action_type": "COMMAND", "content": "**flow_search** _https://nice-project.uni.ex/settings/_\n\n**response**: 198.51.100.10, 198.51.100.14, 198.51.100.45\n", "sender": "", "file_name": "", "timestamp": "2023-11-22T14:47:30.828733", "tool_id": 72}
{"action_log_id": 330, "action_type": "COMMAND", "content": "**contacts** _198.51.100.45_\n\n**response**: peter.quinn@mail.uni.ex\n", "sender": "", "file_name": "", "timestamp": "2023-11-22T14:47:59.347115", "tool_id": 67}
{"action_log_id": 331, "action_type": "COMMAND", "content": "**contacts** _198.51.100.14_\n\n**response**: lisa.grant@mail.uni.ex\n", "sender": "", "file_name": "", "timestamp": "2023-11-22T14:48:04.310768", "tool_id": 67}
{"action_log_id": 337, "action_type": "COMMAND", "content": "**contacts** _198.51.100.10_\n\n**response**: kathy@mail.uni.ex\n", "sender": "", "file_name": "", "timestamp": "2023-11-22T14:48:44.892184", "tool_id": 67}
{"action_log_id": 354, "action_type": "COMMAND", "content": "**DNS lookup** _minas.freemail.ex_\n\n**response**: Website unreachable.\n", "sender": "", "file_name": "", "timestamp": "2023-11-22T14:52:35.850823", "tool_id": 68}
{"action_log_id": 358, "action_type": "COMMAND", "content": "**block_from** _185.36.81.39_\n\n**response**: Target IP address or email address was not found\n", "sender": "", "file_name": "", "timestamp": "2023-11-22T14:54:20.331397", "tool_id": 73}
{"action_log_id": 377, "action_type": "COMMAND", "content": "**block_from** _it_department@mail.ex_\n\n**response**: DONE\n", "sender": "", "file_name": "", "timestamp": "2023-11-22T14:55:53.514641", "tool_id": 73}
{"action_log_id": 392, "action_type": "COMMAND", "content": "**unblock_from** _198.51.100.40_\n\n**response**: DONE\n", "sender": "", "file_name": "", "timestamp": "2023-11-22T14:57:57.874195", "tool_id": 75}
{"action_log_id": 403, "action_type": "COMMAND", "content": "**DNS lookup** _https://nice-project.uni.ex/settings/_\n\n**response**: 198.51.100.40\n", "sender": "", "file_name": "", "timestamp": "2023-11-22T14:59:51.702217", "tool_id": 68}
{"action_log_id": 405, "action_type": "COMMAND", "content": "**flow_search** _https://nice-project.uni.ex/settings/_\n\n**response**: 198.51.100.10, 198.51.100.14, 198.51.100.45\n", "sender": "", "file_name": "", "timestamp": "2023-11-22T14:59:57.816760", "tool_id": 72}
{"action_log_id": 410, "action_type": "COMMAND", "content": "**block_from** _198.51.100.40_\n\n**response**: DONE\n", "sender": "", "file_name": "", "timestamp": "2023-11-22T15:00:18.846885", "tool_id": 73}
{"action_log_id": 504, "action_type": "COMMAND", "content": "**mails_sent_to** _kathy@mail.uni.ex_\n\n**response**: 1 mail sent to kathy@mail.uni.ex from it_department@mail.ex\n", "sender": "", "file_name": "", "timestamp": "2023-11-22T15:17:24.350270", "tool_id": 70}
{"action_log_id": 507, "action_type": "COMMAND", "content": "**mails_sent_to** _peter.quinn@mail.uni.ex_\n\n**response**: 1 mail sent to peter.quinn@mail.uni.ex from it_department@mail.ex\n", "sender": "", "file_name": "", "timestamp": "2023-11-22T15:17:51.902650", "tool_id": 70}
{"action_log_id": 509, "action_type": "COMMAND", "content": "**mails_sent_to** _lisa.grant@mail.uni.ex_\n\n**response**: 1 mail sent to lisa.grant@mail.uni.ex from it_department@mail.ex\n", "sender": "", "file_name": "", "timestamp": "2023-11-22T15:18:09.391362", "tool_id": 70}
{"action_log_id": 510, "action_type": "COMMAND", "content": "**mails_sent_to** _doe@mail.uni.ex_\n\n**response**: 0 mails sent to doe@mail.uni.ex.\n", "sender": "", "file_name": "", "timestamp": "2023-11-22T15:18:24.268183", "tool_id": 70}
{"action_log_id": 522, "action_type": "INJECT", "content": "The exercise will conclude in one minute.\n\nInstructors\n", "sender": "Instructors", "file_name": "", "timestamp": "2023-11-22T15:22:53.042144", "tool_id": null}
{"action_log_id": 536, "action_type": "INJECT", "content": "The exercise is over.\n\nInstructors\n", "sender": "Instructors", "file_name": "", "timestamp": "2023-11-22T15:23:55.385089", "tool_id": null}