{"team_id": 8, "inject_category_id": 0, "sent": true}
{"team_id": 8, "inject_category_id": 1, "sent": true}
{"team_id": 8, "inject_category_id": 2, "sent": true}
{"team_id": 8, "inject_category_id": 3, "sent": true}
{"team_id": 8, "inject_category_id": 4, "sent": true}
{"team_id": 8, "inject_category_id": 5, "sent": true}
{"team_id": 8, "inject_category_id": 6, "sent": true}
{"team_id": 8, "inject_category_id": 7, "sent": true}
{"team_id": 8, "inject_category_id": 8, "sent": true}
{"team_id": 8, "inject_category_id": 9, "sent": true}
{"team_id": 8, "inject_category_id": 10, "sent": true}
{"team_id": 8, "inject_category_id": 11, "sent": false}
{"team_id": 8, "inject_category_id": 12, "sent": true}
{"team_id": 8, "inject_category_id": 13, "sent": true}
{"team_id": 8, "inject_category_id": 14, "sent": true}
{"team_id": 8, "inject_category_id": 15, "sent": true}
{"team_id": 8, "inject_category_id": 16, "sent": false}
{"team_id": 8, "inject_category_id": 17, "sent": false}