{"participant_id": 1, "address": "kathy@mail.uni.ex", "team_id": null, "definition_address": {"email_address_id": 1, "address": "kathy@mail.uni.ex", "description": "Email address for Kathy Lee, who was affected by the phishing attack.", "reach_milestone": "email_kathy", "team_visible": true, "organization": ""}, "exercise_id": 1}
{"participant_id": 2, "address": "lisa.grant@mail.uni.ex", "team_id": null, "definition_address": {"email_address_id": 2, "address": "lisa.grant@mail.uni.ex", "description": "Email address of Lisa Grant, who was affected by the phishing attack.", "reach_milestone": "email_lisa", "team_visible": true, "organization": ""}, "exercise_id": 1}
{"participant_id": 3, "address": "peter.quinn@mail.uni.ex", "team_id": null, "definition_address": {"email_address_id": 3, "address": "peter.quinn@mail.uni.ex", "description": "Email address of Peter Quinn, who was affected by the phishing attack.", "reach_milestone": "email_peter", "team_visible": true, "organization": ""}, "exercise_id": 1}
{"participant_id": 4, "address": "doe@mail.uni.ex", "team_id": null, "definition_address": {"email_address_id": 4, "address": "doe@mail.uni.ex", "description": "Email address of Dr. Doe, who notifies CSIRT-U about the phishing attack.", "reach_milestone": "", "team_visible": true, "organization": ""}, "exercise_id": 1}
{"participant_id": 5, "address": "jane.taylor@mail.uni.ex", "team_id": null, "definition_address": {"email_address_id": 5, "address": "jane.taylor@mail.uni.ex", "description": "Email address of Jane Taylor, who is the project manager of Nice project", "reach_milestone": "", "team_visible": true, "organization": ""}, "exercise_id": 1}
{"participant_id": 6, "address": "cloud@uni.ex", "team_id": null, "definition_address": {"email_address_id": 6, "address": "cloud@uni.ex", "description": "Email address to university cloud provider", "reach_milestone": "email_cloud", "team_visible": true, "organization": ""}, "exercise_id": 1}
{"participant_id": 7, "address": "harris@mail.uni.ex", "team_id": null, "definition_address": {"email_address_id": 7, "address": "harris@mail.uni.ex", "description": "Email address of Mr. Harris, who is the VM admin/owner", "reach_milestone": "email_harris", "team_visible": true, "organization": ""}, "exercise_id": 1}
{"participant_id": 8, "address": "dpo@mail.uni.ex", "team_id": null, "definition_address": {"email_address_id": 8, "address": "dpo@mail.uni.ex", "description": "Email address of DPO", "reach_milestone": "email_dpo", "team_visible": true, "organization": ""}, "exercise_id": 1}
{"participant_id": 9, "address": "instructors@help.com", "team_id": null, "definition_address": {"email_address_id": 9, "address": "instructors@help.com", "description": "Contact from participants to instructors", "reach_milestone": "email_instructors", "team_visible": true, "organization": ""}, "exercise_id": 1}
{"participant_id": 10, "address": "abuse@freemail.ex", "team_id": null, "definition_address": {"email_address_id": 10, "address": "abuse@freemail.ex", "description": "Email address of CSIRT of Freemail provider", "reach_milestone": "", "team_visible": true, "organization": ""}, "exercise_id": 1}
{"participant_id": 11, "address": "it_department@mail.ex", "team_id": null, "definition_address": {"email_address_id": 11, "address": "it_department@mail.ex", "description": "Email address of it_department, used to send spam", "reach_milestone": "email_it_department", "team_visible": true, "organization": ""}, "exercise_id": 1}
{"participant_id": 12, "address": "team1@mail.com", "team_id": 1, "definition_address": null, "exercise_id": 1}
{"participant_id": 13, "address": "team2@mail.com", "team_id": 2, "definition_address": null, "exercise_id": 1}
{"participant_id": 14, "address": "team3@mail.com", "team_id": 3, "definition_address": null, "exercise_id": 1}
{"participant_id": 15, "address": "team4@mail.com", "team_id": 4, "definition_address": null, "exercise_id": 1}
{"participant_id": 16, "address": "team5@mail.com", "team_id": 5, "definition_address": null, "exercise_id": 1}
{"participant_id": 17, "address": "team6@mail.com", "team_id": 6, "definition_address": null, "exercise_id": 1}
{"participant_id": 18, "address": "team7@mail.com", "team_id": 7, "definition_address": null, "exercise_id": 1}
{"participant_id": 19, "address": "team8@mail.com", "team_id": 8, "definition_address": null, "exercise_id": 1}
{"participant_id": 20, "address": "team9@mail.com", "team_id": 9, "definition_address": null, "exercise_id": 1}
{"participant_id": 21, "address": "team10@mail.com", "team_id": 10, "definition_address": null, "exercise_id": 1}
{"participant_id": 22, "address": "team11@mail.com", "team_id": 11, "definition_address": null, "exercise_id": 1}
{"participant_id": 23, "address": "team12@mail.com", "team_id": 12, "definition_address": null, "exercise_id": 1}