{"milestone_id": 133, "reached": true, "timestamp_reached": "2023-11-22T14:55:10.599288"}
{"milestone_id": 134, "reached": false, "timestamp_reached": null}
{"milestone_id": 135, "reached": false, "timestamp_reached": null}
{"milestone_id": 136, "reached": false, "timestamp_reached": null}
{"milestone_id": 137, "reached": false, "timestamp_reached": null}
{"milestone_id": 138, "reached": false, "timestamp_reached": null}
{"milestone_id": 139, "reached": true, "timestamp_reached": "2023-11-22T15:18:44.380254"}
{"milestone_id": 140, "reached": false, "timestamp_reached": null}
{"milestone_id": 141, "reached": false, "timestamp_reached": null}
{"milestone_id": 142, "reached": false, "timestamp_reached": null}
{"milestone_id": 143, "reached": false, "timestamp_reached": null}
{"milestone_id": 144, "reached": false, "timestamp_reached": null}
{"milestone_id": 145, "reached": true, "timestamp_reached": "2023-11-22T14:48:56.502912"}
{"milestone_id": 146, "reached": true, "timestamp_reached": "2023-11-22T15:12:41.883463"}
{"milestone_id": 147, "reached": false, "timestamp_reached": null}
{"milestone_id": 148, "reached": true, "timestamp_reached": "2023-11-22T15:00:31.400159"}
{"milestone_id": 149, "reached": true, "timestamp_reached": "2023-11-22T14:37:18.077678"}
{"milestone_id": 150, "reached": true, "timestamp_reached": "2023-11-22T14:39:04.892976"}
{"milestone_id": 151, "reached": true, "timestamp_reached": "2023-11-22T14:39:38.083733"}
{"milestone_id": 152, "reached": true, "timestamp_reached": "2023-11-22T14:40:34.616175"}
{"milestone_id": 153, "reached": true, "timestamp_reached": "2023-11-22T15:03:26.096059"}
{"milestone_id": 154, "reached": false, "timestamp_reached": null}