{"thread_id": 183, "description": "Email address of CSIRT of Freemail provider", "timestamp": "2023-11-22T14:23:56.147445", "participants": [168, 173], "emails": [{"email_id": 209, "thread_id": 183, "sender_id": 168, "content": "Greetings,\nplease see attached one of phishing mails with forged sender and a link to your website. Please have a look at that.\nThanks,\n\nFREEMAIL provider\n", "file_name": "freemail_phishing.zip", "timestamp": "2023-11-22T14:23:56.215344"}, {"email_id": 247, "thread_id": 183, "sender_id": 173, "content": "Greetings,\n\nafter taking a look at the attachment, we decided to block the phishing website that was sent in the suspicious e-mail.", "file_name": "", "timestamp": "2023-11-22T14:36:31.101602"}, {"email_id": 260, "thread_id": 183, "sender_id": 168, "content": "Greetings,\n\nThank you for looking into the issue.\n\nFREEMAIL provider\n", "file_name": "", "timestamp": "2023-11-22T14:42:33.173002"}, {"email_id": 325, "thread_id": 183, "sender_id": 168, "content": "Greetings,\nour users are still getting phishing mails with a phishing form hosted in your network at https://nice-project.uni.ex/. Please take it down.\n\nRegards,\nFREEMAIL provider\n", "file_name": "", "timestamp": "2023-11-22T14:57:58.037675"}]}
{"thread_id": 195, "description": "Email address of Dr. Doe, who notifies CSIRT-U about the phishing attack.", "timestamp": "2023-11-22T14:28:55.692875", "participants": [163, 173], "emails": [{"email_id": 221, "thread_id": 195, "sender_id": 163, "content": "Dear CSIRT-U,\nI'm forwarding yet another phishing mail.\n\nBest regards,\n--\nDr. Doe\nFaculty of Science\n\nOn 30.8.2021 23:17, Admin <mailto:it_department@mail.ex> wrote:\n\n\nhttps://nice-project.uni.ex/settings/?email=doe@mail.uni.ex\nhttps://nice-project.uni.ex/settings/?email=doe@mail.uni.ex\nhttps://nice-project.uni.ex/settings/?email=doe@mail.uni.ex\n\nYour Account will soon be suspended\nYour allowed Email Quota usage has been exceeded on your account.\n\"doe@mail.uni.ex\"\nPlease kindly verify you are Human and not a robot by following the below link, so we can get your account running normal and retreive all pending mails.\nhttps://nice-project.uni.ex/settings/?email=doe@mail.uni.ex\n\n\n<=\"\" account=\"\">\nNote: You must verify your account using webmail to enable you access your account after 12:00AM before you can send mail.\nIf no action is taken, you may cease to receive incoming emails\nThis Email was sent to \"doe@mail.uni.ex\" as a User from \"mail.uni.ex\"\n\nSincerely\nmail.uni.ex support team.\n", "file_name": "user_phishing_mail.txt", "timestamp": "2023-11-22T14:28:55.737764"}, {"email_id": 470, "thread_id": 195, "sender_id": 173, "content": "Dear Dr. Doe,\n\nwe have checked the e-mail traffic, however, we do not see exceeding number of email sent or received from your e-mail address, which is suspicious. Please explain yourself.", "file_name": "", "timestamp": "2023-11-22T15:24:11.051912"}]}
{"thread_id": 208, "description": "Email address of Jane Taylor, who is the project manager of Nice project", "timestamp": "2023-11-22T14:33:54.821024", "participants": [164, 173], "emails": [{"email_id": 236, "thread_id": 208, "sender_id": 164, "content": "To: jane.taylor@mail.uni.ex\n\nSubject: Suspicious content of our project homepage\n\nGreetings,\ncould you please investigate what happened at our website? When I visited our web presentation: https://nice-project.uni.ex/ an hour ago, I could see only a folder with some files (see attachment) instead of our web presentation. Now I suddenly cannot access the website at all.\nThanks a lot!\n\nJane Taylor\nproject manager\nNice project\n", "file_name": "nice-project-root.png", "timestamp": "2023-11-22T14:33:54.906387"}, {"email_id": 257, "thread_id": 208, "sender_id": 173, "content": "Greetings,\n\nwe were forced to block the mentioned website because of suspicious activity coming from the website. We are looking into it and we will keep you updated in case the website is unblocked.", "file_name": "", "timestamp": "2023-11-22T14:41:58.290451"}, {"email_id": 279, "thread_id": 208, "sender_id": 164, "content": "Oh no, our web needs to stay online as long as possible!\n\nRegards,\n\nJane Taylor\nproject manager\nNice project     \n", "file_name": "", "timestamp": "2023-11-22T14:49:59.039744"}, {"email_id": 391, "thread_id": 208, "sender_id": 173, "content": "Greetins,\n\nwould it be possible to provide us with an information about people who have access to make changes to the project website ?", "file_name": "", "timestamp": "2023-11-22T15:10:45.716053"}, {"email_id": 432, "thread_id": 208, "sender_id": 164, "content": "Sorry, I'm a project manager without IT background.", "file_name": "", "timestamp": "2023-11-22T15:18:07.059234"}]}
{"thread_id": 242, "description": "Email address of Peter Quinn, who was affected by the phishing attack.", "timestamp": "2023-11-22T15:07:16.555722", "participants": [162, 173], "emails": [{"email_id": 374, "thread_id": 242, "sender_id": 173, "content": "Greetings,\n\nWe have received complains about a website nice-project.uni.ex. When we checked the logs we noticed that only receivers of this email have accessed the settings part of this website. If possible, we would like to ask you to try to remove the malicious content from the website and check people who have permission to change the website. If the malicious content is not removed, the website will stay blocked.\n\n", "file_name": "", "timestamp": "2023-11-22T15:07:16.766721"}]}
{"thread_id": 243, "description": "Email address of Lisa Grant, who was affected by the phishing attack.", "timestamp": "2023-11-22T15:07:40.510486", "participants": [161, 173], "emails": [{"email_id": 376, "thread_id": 243, "sender_id": 173, "content": "Greetings,\n\nWe have received complains about a website nice-project.uni.ex. When we checked the logs we noticed that only receivers of this email have accessed the settings part of this website. If possible, we would like to ask you to try to remove the malicious content from the website and check people who have permission to change the website. If the malicious content is not removed, the website will stay blocked.", "file_name": "", "timestamp": "2023-11-22T15:07:40.704368"}, {"email_id": 404, "thread_id": 243, "sender_id": 161, "content": "Greetings,\nYes, I have visited https://nice-project.uni.ex/.\nShould I reinstall my computer???\n\nBest regards,\nLisa Grant\n", "file_name": "", "timestamp": "2023-11-22T15:13:32.270035"}, {"email_id": 423, "thread_id": 243, "sender_id": 173, "content": "Greetings,\n\nthere is no need to reinstall your computer, however if you have used your credentials on the said website, we would recommend you to change them imemdiately.", "file_name": "", "timestamp": "2023-11-22T15:16:42.918508"}, {"email_id": 428, "thread_id": 243, "sender_id": 161, "content": "Greetings,\nI just changed my password.\n\nBest regards,\nLisa Grant\n", "file_name": "", "timestamp": "2023-11-22T15:17:06.680721"}]}
{"thread_id": 244, "description": "Email address for Kathy Lee, who was affected by the phishing attack.", "timestamp": "2023-11-22T15:08:06.546935", "participants": [160, 173], "emails": [{"email_id": 378, "thread_id": 244, "sender_id": 173, "content": "Greetings,\n\nWe have received complains about a website nice-project.uni.ex. When we checked the logs we noticed that only receivers of this email have accessed the settings part of this website. If possible, we would like to ask you to try to remove the malicious content from the website and check people who have permission to change the website. If the malicious content is not removed, the website will stay blocked.", "file_name": "", "timestamp": "2023-11-22T15:08:06.716806"}, {"email_id": 421, "thread_id": 244, "sender_id": 160, "content": "Greetings,\nYes, I have visited https://nice-project.uni.ex/.\nShould I reinstall my computer???\n\nBest regards,\nKathy Lee\n", "file_name": "", "timestamp": "2023-11-22T15:16:37.342698"}, {"email_id": 443, "thread_id": 244, "sender_id": 173, "content": "Greetings,\n\nthere is no need to reinstall your computer, however if you have used your credentials on the said website, we would recommend you to change them imemdiately.", "file_name": "", "timestamp": "2023-11-22T15:18:53.035414"}, {"email_id": 455, "thread_id": 244, "sender_id": 160, "content": "Greetings,\nI just changed my password.\n\nBest regards,\nKathy Lee\n", "file_name": "", "timestamp": "2023-11-22T15:21:11.224375"}]}