{"thread_id": 4, "description": "Contact from participants to instructors", "timestamp": "2023-11-08T14:32:14.983644", "participants": [9, 15], "emails": [{"email_id": 5, "thread_id": 4, "sender_id": 15, "content": "This is a test mail with some content inside of it.", "file_name": "", "timestamp": "2023-11-08T14:32:15.210144"}, {"email_id": 11, "thread_id": 4, "sender_id": 9, "content": "Test - message received by the instructor. ", "file_name": "", "timestamp": "2023-11-08T14:36:40.611666"}]}
{"thread_id": 9, "description": "Email address of CSIRT of Freemail provider", "timestamp": "2023-11-08T14:37:46.466114", "participants": [10, 15], "emails": [{"email_id": 15, "thread_id": 9, "sender_id": 10, "content": "Greetings,\nplease see attached one of phishing mails with forged sender and a link to your website. Please have a look at that.\nThanks,\n\nFREEMAIL provider\n", "file_name": "freemail_phishing.zip", "timestamp": "2023-11-08T14:37:46.514424"}, {"email_id": 43, "thread_id": 9, "sender_id": 15, "content": "Hi,\nthanks for the report, we will take a look at it and analyze what further actions should be taken.\n", "file_name": "", "timestamp": "2023-11-08T14:43:57.832370"}, {"email_id": 48, "thread_id": 9, "sender_id": 10, "content": "Greetings,\n\nThank you for looking into the issue.\n\nFREEMAIL provider\n", "file_name": "", "timestamp": "2023-11-08T14:45:58.158932"}]}
{"thread_id": 21, "description": "Email address of Dr. Doe, who notifies CSIRT-U about the phishing attack.", "timestamp": "2023-11-08T14:42:46.207684", "participants": [4, 15], "emails": [{"email_id": 32, "thread_id": 21, "sender_id": 4, "content": "Dear CSIRT-U,\nI'm forwarding yet another phishing mail.\n\nBest regards,\n--\nDr. Doe\nFaculty of Science\n\nOn 30.8.2021 23:17, Admin <mailto:it_department@mail.ex> wrote:\n\n\nhttps://nice-project.uni.ex/settings/?email=doe@mail.uni.ex\nhttps://nice-project.uni.ex/settings/?email=doe@mail.uni.ex\nhttps://nice-project.uni.ex/settings/?email=doe@mail.uni.ex\n\nYour Account will soon be suspended\nYour allowed Email Quota usage has been exceeded on your account.\n\"doe@mail.uni.ex\"\nPlease kindly verify you are Human and not a robot by following the below link, so we can get your account running normal and retreive all pending mails.\nhttps://nice-project.uni.ex/settings/?email=doe@mail.uni.ex\n\n\n<=\"\" account=\"\">\nNote: You must verify your account using webmail to enable you access your account after 12:00AM before you can send mail.\nIf no action is taken, you may cease to receive incoming emails\nThis Email was sent to \"doe@mail.uni.ex\" as a User from \"mail.uni.ex\"\n\nSincerely\nmail.uni.ex support team.\n", "file_name": "user_phishing_mail.txt", "timestamp": "2023-11-08T14:42:46.299730"}, {"email_id": 69, "thread_id": 21, "sender_id": 15, "content": "Hi,\nthanks for the forward of the phishing mail, we will take a look into it and then update you on any findings.\n\nCSIRT-U", "file_name": "", "timestamp": "2023-11-08T14:48:08.583192"}, {"email_id": 71, "thread_id": 21, "sender_id": 4, "content": "Dear CSIRT-U,\nI'm glad we have such great security team!\n\nDr. Doe\n", "file_name": "", "timestamp": "2023-11-08T14:49:33.978320"}]}
{"thread_id": 35, "description": "Email address of Jane Taylor, who is the project manager of Nice project", "timestamp": "2023-11-08T14:47:46.499269", "participants": [5, 15], "emails": [{"email_id": 60, "thread_id": 35, "sender_id": 5, "content": "To: jane.taylor@mail.uni.ex\n\nSubject: Suspicious content of our project homepage\n\nGreetings,\ncould you please investigate what happened at our website? When I visited our web presentation: https://nice-project.uni.ex/ an hour ago, I could see only a folder with some files (see attachment) instead of our web presentation. Now I suddenly cannot access the website at all.\nThanks a lot!\n\nJane Taylor\nproject manager\nNice project\n", "file_name": "nice-project-root.png", "timestamp": "2023-11-08T14:47:46.570131"}, {"email_id": 76, "thread_id": 35, "sender_id": 15, "content": "Hi,\n\nunfortunately the website you are trying to reach is currently under attack, we are currently investing this matter and for that reason we had to block trafic from and to that said website.\nWe apologise for inconvinience and we hope that the matter will be resolved soon.\n\nSCIRT-U", "file_name": "", "timestamp": "2023-11-08T14:51:03.085138"}, {"email_id": 90, "thread_id": 35, "sender_id": 5, "content": "Oh no, our web needs to stay online as long as possible!\n\nRegards,\n\nJane Taylor\nproject manager\nNice project     \n", "file_name": "", "timestamp": "2023-11-08T14:55:25.016501"}, {"email_id": 113, "thread_id": 35, "sender_id": 5, "content": "Dear CSIRT-MU, \n\nHow long do you expect the website to be unavailable? Our clients are already complaining about it.\n\nBefore you blocked our website, some of them opened and saw the documents published there. They claim that those files contain sensitive information about them, and now they are complaining a lot. \n\nWe would like to investigate the situation and find out what kind of documents they could have seen. That doesn't work if the page is blocked.\n\nRegards,\n\nJane Taylor\nproject manager\nNice project     ", "file_name": "", "timestamp": "2023-11-08T15:06:46.009323"}, {"email_id": 129, "thread_id": 35, "sender_id": 15, "content": "Hi,\n\nunfortunatelly it is currently not known to us how long the site may be down for.\n\nAs for the clients that have clicked and sent some emails, we have already contacted them and advised them to change their credentials.\n\nCSIRT-U", "file_name": "", "timestamp": "2023-11-08T15:11:05.224553"}, {"email_id": 132, "thread_id": 35, "sender_id": 5, "content": "Dear CSIRT-MU, \n\nthere are other problems related to leakage of sensitive information about our clients. Is there some possibility to see the content of the website before it was blocked? I cannot access the website anymore. Maybe you can? \n\nRegards,\n\nJane Taylor\nproject manager\nNice project     ", "file_name": "", "timestamp": "2023-11-08T15:13:36.704118"}, {"email_id": 143, "thread_id": 35, "sender_id": 15, "content": "Hi,\n\nUnfortunately, we cannot access the website as we would have to unblock it in order to access it, which could put users at risk of accessing the website and leaking more information. As such, we cannot.\n\nCSIRT-U", "file_name": "", "timestamp": "2023-11-08T15:19:06.903015"}, {"email_id": 149, "thread_id": 35, "sender_id": 5, "content": "Do you at least know what data was leaked when you already blocked our site?\n\nJane ", "file_name": "", "timestamp": "2023-11-08T15:22:13.839891"}, {"email_id": 161, "thread_id": 35, "sender_id": 15, "content": "Hi,\n\nwe were able to found out that the sensitive data that may have been compromised may have included names, emails and such. For this reason we have contacted DPO.\n\nCSIRT-U", "file_name": "", "timestamp": "2023-11-08T15:30:02.492690"}]}
{"thread_id": 48, "description": "Email address of it_department, used to send spam", "timestamp": "2023-11-08T14:53:51.744192", "participants": [11, 15], "emails": [{"email_id": 85, "thread_id": 48, "sender_id": 15, "content": "Hi,\nthere have been some reports of phishing attack that were send from your mail, we would like to ask for your cooperation in this matter and as such would like to ask you to check for any potencial injects or any other compromised parts of your system.\n\nCSIRT-U", "file_name": "", "timestamp": "2023-11-08T14:53:51.918825"}, {"email_id": 102, "thread_id": 48, "sender_id": 15, "content": "Hi,\ngoing further it would also be wise to block trafic going from your email untill the said issue is resolved so that no further attacks can happen, as such the trafic from \"it_department@mail.ex\" will be blocked untill the issue is resolved.\n\nCSIRT-U", "file_name": "", "timestamp": "2023-11-08T15:02:08.675719"}]}
{"thread_id": 54, "description": "Email address of Lisa Grant, who was affected by the phishing attack.", "timestamp": "2023-11-08T15:05:40.682154", "participants": [2, 15], "emails": [{"email_id": 110, "thread_id": 54, "sender_id": 15, "content": "Hi,\nwe a strong suspicion that u might have been a victim of phishing attack, as such we would advise for you to change your credentials.\n\nCSIRT-U", "file_name": "", "timestamp": "2023-11-08T15:05:41.405509"}, {"email_id": 126, "thread_id": 54, "sender_id": 2, "content": "Greetings,\nYes, I have visited https://nice-project.uni.ex/.\nShould I reinstall my computer???\n\nBest regards,\nLisa Grant\n", "file_name": "", "timestamp": "2023-11-08T15:09:19.295813"}, {"email_id": 131, "thread_id": 54, "sender_id": 15, "content": "Hi,\n\nthere is no need to reinstall your computer, as we stated in the email before you just have to change your credentials.\n\nCSIRT-U", "file_name": "", "timestamp": "2023-11-08T15:12:02.311641"}, {"email_id": 170, "thread_id": 54, "sender_id": 2, "content": "Greetings,\nI just changed my password. Should my friend Kathy, who clicked on the site, do the same?\n\nBest regards,\nLisa Grant\n", "file_name": "", "timestamp": "2023-11-08T15:34:18.599345"}]}
{"thread_id": 55, "description": "Email address of Peter Quinn, who was affected by the phishing attack.", "timestamp": "2023-11-08T15:05:59.533631", "participants": [3, 15], "emails": [{"email_id": 111, "thread_id": 55, "sender_id": 15, "content": "Hi,\nwe a strong suspicion that u might have been a victim of phishing attack, as such we would advise for you to change your credentials.\n\nCSIRT-U", "file_name": "", "timestamp": "2023-11-08T15:05:59.799706"}]}
{"thread_id": 61, "description": "Email address to university cloud provider", "timestamp": "2023-11-08T15:13:45.836326", "participants": [6, 15], "emails": [{"email_id": 133, "thread_id": 61, "sender_id": 15, "content": "Hi,\nwe would like to ask for your cooperation in the case of phishing attacks that are originating under your ip \"198.51.100.40\", could u provide us with as much possible information that u could?\n\nCSIRT-U", "file_name": "", "timestamp": "2023-11-08T15:13:47.047817"}, {"email_id": 137, "thread_id": 61, "sender_id": 6, "content": "Greetings, \n\nCan you please specify the information you required?\n\n\nBest,\nCloud provider\n", "file_name": "", "timestamp": "2023-11-08T15:16:10.220489"}, {"email_id": 147, "thread_id": 61, "sender_id": 15, "content": "Hi,\n\nit would be great if you could provide us with logs of your website, also contents and lastly contact info for your administrator.\n\nCSIRT-U", "file_name": "", "timestamp": "2023-11-08T15:20:16.728079"}, {"email_id": 148, "thread_id": 61, "sender_id": 6, "content": "Sorry, we don't have any logs. Please contact admin of a VM hosting this web, harris@mail.uni.ex.\n\nBest,\nCloud provider\n", "file_name": "", "timestamp": "2023-11-08T15:21:06.561778"}, {"email_id": 155, "thread_id": 61, "sender_id": 15, "content": "Hi,\nthanks for your cooperation.\n\nCSRIT-U", "file_name": "", "timestamp": "2023-11-08T15:26:46.697380"}]}
{"thread_id": 67, "description": "Email address of Mr. Harris, who is the VM admin/owner", "timestamp": "2023-11-08T15:24:23.304639", "participants": [7, 15], "emails": [{"email_id": 151, "thread_id": 67, "sender_id": 15, "content": "Hi,\n\nwe are currently invastigating the phishing attack that happened from \"198.51.100.40\", we were informed by cloud@uni.ex that u are the administrator for said VM, could u please frovide us with logs and content of the site so that we can know what sort of data might have been compromised.\n\nCSIRT-U", "file_name": "", "timestamp": "2023-11-08T15:24:23.550437"}, {"email_id": 154, "thread_id": 67, "sender_id": 7, "content": "Hello, \nUnfortunately, I was not logging activity on this machine and there were data about various people - names, emails, etc. Some problem? \n\nRegards,\nHarris\n", "file_name": "", "timestamp": "2023-11-08T15:26:36.177778"}, {"email_id": 163, "thread_id": 67, "sender_id": 15, "content": "Hi,\n\nsince sensitive data may have been stolen we have contacted DPO.\n\nCSIRT-U", "file_name": "", "timestamp": "2023-11-08T15:30:47.438239"}]}
{"thread_id": 69, "description": "Email address of DPO", "timestamp": "2023-11-08T15:28:51.835877", "participants": [8, 15], "emails": [{"email_id": 158, "thread_id": 69, "sender_id": 15, "content": "Hi,\n\nwe would like to inform DPO, of recent event where site \"nice-project.uni.ex\" had been compromised and sensitive information (names, emails and dates of birth) may have been stolen.\n\nCSRIT-U", "file_name": "", "timestamp": "2023-11-08T15:28:52.040999"}, {"email_id": 159, "thread_id": 69, "sender_id": 8, "content": "Dear CSIRT-U,\n\nthanks for reporting this incident. I will take a look at this ASAP.\n\nSincerely,\nKim Hoffman\nData Protection Officer\n", "file_name": "", "timestamp": "2023-11-08T15:29:11.442763"}]}