{"milestone_id": 133, "name": "nice-project_traffic_blocked", "team_visible": false, "roles": "", "file_names": ""}
{"milestone_id": 134, "name": "email_cloud", "team_visible": false, "roles": "", "file_names": ""}
{"milestone_id": 135, "name": "email_harris", "team_visible": false, "roles": "", "file_names": ""}
{"milestone_id": 136, "name": "email_dpo", "team_visible": false, "roles": "", "file_names": ""}
{"milestone_id": 137, "name": "email_kathy", "team_visible": false, "roles": "", "file_names": ""}
{"milestone_id": 138, "name": "email_doe", "team_visible": false, "roles": "", "file_names": ""}
{"milestone_id": 139, "name": "email_jane", "team_visible": false, "roles": "", "file_names": ""}
{"milestone_id": 140, "name": "email_lisa", "team_visible": false, "roles": "", "file_names": ""}
{"milestone_id": 141, "name": "email_peter", "team_visible": false, "roles": "", "file_names": ""}
{"milestone_id": 142, "name": "email_freemail", "team_visible": false, "roles": "", "file_names": ""}
{"milestone_id": 143, "name": "email_it_department", "team_visible": false, "roles": "", "file_names": ""}
{"milestone_id": 144, "name": "exercise_finished", "team_visible": false, "roles": "", "file_names": ""}
{"milestone_id": 145, "name": "nice-project_visited", "team_visible": false, "roles": "", "file_names": ""}
{"milestone_id": 146, "name": "it_department_blocked", "team_visible": false, "roles": "", "file_names": ""}
{"milestone_id": 147, "name": "nice-project_owner_found", "team_visible": false, "roles": "", "file_names": ""}
{"milestone_id": 148, "name": "phishing_targets_found", "team_visible": false, "roles": "", "file_names": ""}
{"milestone_id": 149, "name": "hosts_visited_phishing_site_found", "team_visible": false, "roles": "", "file_names": ""}
{"milestone_id": 150, "name": "kathy-host_found", "team_visible": false, "roles": "", "file_names": ""}
{"milestone_id": 151, "name": "lisa-host_found", "team_visible": false, "roles": "", "file_names": ""}
{"milestone_id": 152, "name": "peter-host_found", "team_visible": false, "roles": "", "file_names": ""}
{"milestone_id": 153, "name": "flow_search_nice-project_root", "team_visible": false, "roles": "", "file_names": ""}
{"milestone_id": 154, "name": "nice-project_vm_powered_off", "team_visible": false, "roles": "", "file_names": ""}