{"team_id": 4, "inject_category_id": 1, "sent": true}
{"team_id": 4, "inject_category_id": 2, "sent": false}
{"team_id": 4, "inject_category_id": 3, "sent": true}
{"team_id": 4, "inject_category_id": 4, "sent": true}
{"team_id": 4, "inject_category_id": 5, "sent": true}
{"team_id": 4, "inject_category_id": 6, "sent": false}
{"team_id": 4, "inject_category_id": 7, "sent": false}
{"team_id": 4, "inject_category_id": 8, "sent": false}