{"team_id": 98, "inject_category_id": 49, "sent": true}
{"team_id": 98, "inject_category_id": 50, "sent": false}
{"team_id": 98, "inject_category_id": 51, "sent": true}
{"team_id": 98, "inject_category_id": 52, "sent": true}
{"team_id": 98, "inject_category_id": 53, "sent": true}
{"team_id": 98, "inject_category_id": 54, "sent": false}
{"team_id": 98, "inject_category_id": 55, "sent": true}
{"team_id": 98, "inject_category_id": 56, "sent": true}