{
    "# hodnoty attack_complexicity": "1 - low, 2 - medium, 3 - high",
    "# hodnoty severity": "0 - info, 1 - low, 2 - medium, 3 - high, 4 - critical",
    "# hodnoty system_impact": "1 - low, 2 - medium, 3 - high",
    "attack_complexicity": 1,
    "author": "Peter Šinaľ,lnovy",
    "description": "Na základě oznamované verze bylo na uvedených adresách detekovaná přítomnost zastaralé verze Apache obsahujíci řadu zranitelností:\n - Eskalace oprávnění v modulu 'scripts' (CVE-2019-0211).\n - Možnost obejít kontrolu přístupu v modulu 'mod_auth_digest' (CVE-2019-0217) a 'mod_ssl' (CVE-2019-0215).\n - Další chyby včetně DoS, read-after-free a URL path normalization.",
    "ignore_pluginoutput": "true",
    "impact": " - Místní útočník je schopen eskalovat oprávnění (CVE-2019-0211).\n - Útočník ze znalosti validních přihlašovacích údajů je schopen využít tyto zranitelnosti k přihlášení s jiným uživatelským jménem (CVE-2019-0217, CVE-2019-0215).\n - Vzdálený útočník je schopný dosáhnout odepření služby.",
    "links": [
        "https://cve.mitre.org/cgi-bin/cvename.cgi?name=CVE-2019-0196",
        "http://www.nessus.org/u?a84bee48",
        "http://www.nessus.org/u?586e6a34"
    ],
    "name": "Apache < 2.4.39 – řada zranitelností",
    "original_description": "According to its banner, the version of Apache running on the remote host is 2.4.x prior to 2.4.39. It is, therefore, affected by multiple vulnerabilities:\n\n  - A privilege escalation vulnerability exists in     module scripts due to an ability to execute arbitrary     code as the parent process by manipulating the     scoreboard. (CVE-2019-0211)\n\n  - An access control bypass vulnerability exists in     mod_auth_digest due to a race condition when running     in a threaded server. An attacker with valid credentials     could authenticate using another username. (CVE-2019-0217)\n\n  - An access control bypass vulnerability exists in     mod_ssl when using per-location client certificate     verification with TLSv1.3. (CVE-2019-0215)\n\nIn addition, Apache httpd is also affected by several additional vulnerabilities including a denial of service, read-after-free and URL path normalization inconsistencies. \n\nNote that Nessus has not tested for these issues but has instead relied only on the application's self-reported version number.",
    "recommendations": "Aktualizujte Apache na poslední aktuální verzi, pro odstranění zranitelností alespoň na verzi 2.4.39.",
    "severity": 3,
    "system_impact": 3
}