{
    "# comment severity": "0 - info, 1 - low, 2 - medium, 3 - high, 4 - critical",
    "# hodnoty attack_complexicity": "1 - low, 2 - medium, 3 - high",
    "# hodnoty system_impact": "1 - low, 2 - medium, 3 - high",
    "attack_complexicity": 3,
    "author": "lnovy",
    "description": "Aplikace nezmění obsah Session Cookie XXX (nevytvoří novou Session a starou nezneplatní) po úspěšném přihlášení uživatele. ",
    "impact": "Útočník s předchozím přístupem k prohlížeči oběti může do prohlížeče zadat Sesssion Cookie, vyčkat na přihlášení uživatele tímto identifikátorem a následně zneužit tuto přihlášenou session. ",
    "links": [
        "https://owasp.org/www-community/attacks/Session_fixation"
    ],
    "name": "Session fixation",
    "recommendations": "Vynuťte změnu hodnoty identifikátoru Session při úspěšném přihlášení uživatele vytvořením nové a zneplatněním staré Session. ",
    "severity": 1,
    "system_impact": 1
}