{
    "# hodnoty attack_complexicity": "1 - low, 2 - medium, 3 - high",
    "# hodnoty severity": "0 - info, 1 - low, 2 - medium, 3 - high, 4 - critical",
    "# hodnoty system_impact": "1 - low, 2 - medium, 3 - high",
    "attack_complexicity": 1,
    "author": "Peter Šinaľ,lnovy",
    "description": "Výše uvedené služby používají pro zabezpečení komunikace mezi serverem a klientem šifrování pomocí SSL/TLS protokolu. Server však nabízí při sestavování zabezpečeného spojení použití protokolů SSLv2 a/nebo SSLv3, jež obsahují několik kryptografických zranitelností, jako například nebezpečný způsob zarovnání (padding) při použití blokové šifry CBC nebo nedostatečně bezpečný způsob znovuustavení šifrovaného spojení. ",
    "ignore_pluginoutput": "true",
    "impact": "Přestože protokoly SSL/TLS obsahují mechanismy k výběru nejbezpečnější formy šifrovaní podporované oběma stranami komunikace, mnoho webových prohlížečů obsahuje chyby v implementaci těchto mechanismů a umožňuje tím degradaci způsobu šifrování (např. útok typu POODLE). Útočník schopný odposlouchávat šifrovanou komunikaci mezi klientem a serverem je potenciálně schopen komunikaci rozšifrovat a/nebo provádět útoky typu Man-in-the-middle.",
    "links": [
        "https://www.schneier.com/academic/paperfiles/paper-ssl.pdf",
        "https://docs.microsoft.com/en-US/dotnet/framework/network-programming/tls#configuring-schannel-protocols-in-the-windows-registry",
        "https://www.openssl.org/~bodo/ssl-poodle.pdf",
        "https://www.imperialviolet.org/2014/10/14/poodle.html",
        "https://tools.ietf.org/html/rfc7507",
        "https://tools.ietf.org/html/rfc7568"
    ],
    "name": "SSL/TLS – podpora SSLv2 a SSLv3",
    "original_description": "The remote service accepts connections encrypted using SSL 2.0 and/or SSL 3.0. These versions of SSL are affected by several cryptographic flaws, including:\n\n  - An insecure padding scheme with CBC ciphers.\n\n  - Insecure session renegotiation and resumption schemes.\n\nAn attacker can exploit these flaws to conduct man-in-the-middle attacks or to decrypt communications between the affected service and clients.\n\nAlthough SSL/TLS has a secure means for choosing the highest supported version of the protocol (so that these versions will be used only if the client or server support nothing better), many web browsers implement this in an unsafe way that allows an attacker to downgrade a connection (such as in POODLE). Therefore, it is recommended that these protocols be disabled entirely.\n\nNIST has determined that SSL 3.0 is no longer acceptable for secure communications. As of the date of enforcement found in PCI DSS v3.1, any version of SSL will not meet the PCI SSC's definition of 'strong cryptography'.",
    "recommendations": "Zakažte v konfiguraci SSL/TLS použití SSLv2 a SSLv3 protokolu a používejte pouze TLS 1.2 nebo novější.",
    "severity": 4,
    "system_impact": 3
}