{
    "# comment severity": "0 - info, 1 - low, 2 - medium, 3 - high, 4 - critical",
    "# hodnoty attack_complexicity": "1 - low, 2 - medium, 3 - high",
    "# hodnoty system_impact": "1 - low, 2 - medium, 3 - high",
    "# original description": "The 'commonName' (CN) attribute of the SSL certificate presented for this service is for a different machine.",
    "attack_complexicity": 1,
    "author": "Jaroslav Vojtěch,lnovy",
    "description": "Atribut 'commonName' (CN) certifikátu SSL předloženého pro tuto službu je pro jiné zařízení.",
    "impact": "Certifikát předložený serverem nelze pro spojení na tento server považovat za důvěryhodný. Uživatel musí platnost certifikátu potvrdit, což není dobrá bezpečnostní praxe.",
    "links": [],
    "name": "SSL/TLS – certifikát se špatným názvem hostitele",
    "recommendations": "Nainstalujte na server platný certifikát s korektním názvem hostiele vydaný uznávanou certifikační autoritou.",
    "severity": 2,
    "system_impact": 1
}