{
    "attack_complexicity": 0,
    "attack_complexicity_original": 0,
    "author": "lnovy",
    "description": "Auditovaný systém má povolené ovladače zařízení pro USB uložiště.",
    "description_original": "https://cisofy.com/lynis/controls/USB-1000/ (plugin napr. pise: Disable drivers like USB storage when not used, to prevent unauthorized storage or data theft)",
    "impact": "Útočník s lokálním přístupem k systému je schopen provádět prostřednictvím USB uložiště exfiltraci.",
    "impact_original": "",
    "links": [
        "https://cisofy.com/lynis/controls/USB-1000/"
    ],
    "links_original": [],
    "name": "Hardware – ovladače USB uložiště",
    "name_original": "",
    "recommendations": "Pokud nejsou USB uložište systémem potřeba, zakažte jejich používání pomocí 'blacklist usb-storage' v souboru /etc/modprobe.d/blacklist-usb-storage.conf.",
    "recommendations_original": "",
    "severity": 0,
    "severity_original": 0,
    "system_impact": 0,
    "system_impact_original": 0
}