{
    "# hodnoty attack_complexicity": "1 - low, 2 - medium, 3 - high",
    "# hodnoty severity": "0 - info, 1 - low, 2 - medium, 3 - high, 4 - critical",
    "# hodnoty system_impact": "1 - low, 2 - medium, 3 - high",
    "# original description": "According to its self-reported version number, the version of PHP running on the remote web server is prior to 7.3.28.\nIt is, therefore affected by an email header injection vulnerability, due to a failure to properly handle CR-LF sequences in header fields. An unauthenticated, remote attacker can exploit this, by inserting line feed characters into email headers, to gain full control of email header content.",
    "attack_complexicity": 2,
    "author": "Alexej Demjanenko,lnovy",
    "description": "Interpret jazyka PHP je dle oznamované verze před verzí 7.3.28 je proto ovlivněn chybou při zpracování znaků CR-LF v hlavičkách emailů.",
    "impact": "Útočník je schopný manipulovat s hlavičkami emailů zasílaných aplikací a může tím ovlivnit cílovou adresu či jiné chování při doručování emailů.",
    "links": [
        "https://www.php.net/ChangeLog-7.php#7.3.28"
    ],
    "name": "PHP < 7.3.28 – vložení hlaviček e-mailu",
    "recommendations": "Aktualizujte interpret jazyka PHP na poslední stabilní verzi nebo pro odstranění uvedené zranitelnosti alespoň na verzi 7.3.28.",
    "severity": 2,
    "system_impact": 2
}