{
    "# comment attack_complexicity": "1 - low, 2 - medium, 3 - high",
    "# comment severity": "0 - info, 1 - low, 2 - medium, 3 - high, 4 - critical",
    "# comment system_impact": "1 - low, 2 - medium, 3 - high",
    "attack_complexicity": 2,
    "author": "Petr Svoboda,lnovy",
    "description": "Konfigurace službz vzdálené plochy dovoluje zabezpečit komunikaci mezi klientem a serverem pomocí nedostatečně silného šifrování (úroveň zabezpečení je nastavena na nižší, než vysokou úroveň). K dispozici jsou čtyři úrovně nastavení:\n - Odpovídající standardu FIPS - komunikace mezi serverem a klientem je šifrována algoritmy, které odpovídají standardu Federal Information Processing Standard (FIPS)\n - Vysoká - komunikace mezi serverem a klientem je šifrována a používá 128-bitový klíč\n - Střední / kompatibilní - komunikace mezi serverem a klientem je šifrována a používá se nejsilnější klientem podporované šifrování\n - Nízká - šifrována jsou pouze data posílaná klientem serveru, k šifrování je použit 56-bitový klíč",
    "impact": "Použití slabých šifrovacích algoritmů usnadňuje pokusy o rozšifrování zabezpečené komunikace - získání snímků obrazovky a/nebo stisknutých kláves",
    "links": [
        "https://docs.microsoft.com/en-us/previous-versions/windows/it-pro/windows-server-2003/cc780081(v=ws.10)"
    ],
    "name": "RDP – nedostatečně silné šifrování",
    "recommendations": "Nastavte úroveň zabezpečení na vysokou nebo FIPS kompatibilní.",
    "severity": 2,
    "system_impact": 2
}