{
    "# hodnoty attack_complexicity": "1 - low, 2 - medium, 3 - high",
    "# hodnoty severity": "0 - info, 1 - low, 2 - medium, 3 - high, 4 - critical",
    "# hodnoty system_impact": "1 - low, 2 - medium, 3 - high",
    "# original description": "https://cisofy.com/lynis/controls/PHP-2372/ (plugin napr. pise: Turn off PHP information exposure|expose_php = Off)",
    "attack_complexicity": 3,
    "author": "Petr Svoboda",
    "description": "V konfiguraci PHP je zapnutý výpis verze a podpory jazyka.",
    "impact": "Útočník je schopen z HTTP hlaviček odpovědí serveru zjistit používanou verzi PHP, což může pomoci v lepším zacílení potenciálních útoků.",
    "links": [
        "https://www.php.net/manual/en/ini.core.php#ini.expose-php"
    ],
    "name": "PHP – informační únik (expose_php)",
    "recommendations": "Vypněte informování o použití PHP v HTTP hlavičkách odpovědí nastavením konfigurační proměnné expose_php na hodnotu „Off“.",
    "severity": 1,
    "system_impact": 1
}