{
    "# hodnoty attack_complexicity": "1 - low, 2 - medium, 3 - high",
    "# hodnoty severity": "0 - info, 1 - low, 2 - medium, 3 - high, 4 - critical",
    "# hodnoty system_impact": "1 - low, 2 - medium, 3 - high",
    "attack_complexicity": 1,
    "author": "Peter Šinaľ,lnovy",
    "description": "Konfigurace službz SMB umožňuje přihlášení na základě tzv. „NULL session“, tedy bez nutnosti použití přihlašovacích údajů.",
    "impact": "Neautentizovaný vzdálený útočník má možnost získat potenciálně cenné informace o systému včetně seznamu:\n - uživatelů\n - skupiny\n - sdílených svazků\n - služeb",
    "links": [
        "https://cve.mitre.org/cgi-bin/cvename.cgi?name=CVE-1999-0519",
        "http://www.nessus.org/u?5c2589f6",
        "http://www.nessus.org/u?899b4072",
        "http://www.nessus.org/u?a33fe205"
    ],
    "name": "SMB – podpora NULL session",
    "original_description": "The remote host is running Microsoft Windows. It is possible to   log into it using a NULL session (i.e., with no login or password).\n\n  Depending on the configuration, it may be possible for an unauthenticated, remote attacker to leverage this issue to   get information about the remote host.",
    "recommendations": "V případě potřeby službu SMB na systému provozovat doporučujeme pro eliminaci „SMB NULL session“ provést následující změny v registrech a následně restartovat systém.\n\nNastavení:\n\nHKLM\\SYSTEM\\CurrentControlSet\\Control\\LSA\\RestrictAnonymous=1\n\nHKLM\\SYSTEM\\CurrentControlSet\\Services\\lanmanserver\\parameters\restrictnullsessaccess=1\n\nOdebrání „BROWSER“ z:\n\nHKLM\\SYSTEM\\CurrentControlSet\\Services\\lanmanserver\\parameters\\NullSessionPipes.",
    "severity": 3,
    "system_impact": 1
}