{
    "attack_complexicity": 1,
    "attack_complexicity_original": 1,
    "author": "lnovy",
    "description": "Firmware iDRAC8 / iDRAC8 je dle oznamované verze před verzí 2.52.52.52 a tudíž trpící řadou bezpečnostních nedostatků:\n - Vzdálené spuštění kódu (CVE-2018-1207). \n - Path traversal (CVE-2018-1211).\n - Heap corruption v komponentě net-snmp (CVE-2018-1000116).",
    "description_original": "The remote host is running iDRAC7 or iDRAC8 with a firmware version prior to 2.52.52.52 and is therefore affected by multiple vulnerabilities.",
    "impact": "Vzdálený nepřihlášený útočník je schopný provádět vlastní kód (CVE-2018-1207), získat citlivé (konfigurační) informace (CVE-2018-1211) a způsobit odepření služby (CVE-2018-1000116).",
    "impact_original": "",
    "links": [
        "http://www.nessus.org/u?6063b726",
        "https://nvd.nist.gov/vuln/detail/CVE-2018-1207",
        "https://downloads.dell.com/solutions/dell-management-solution-resources/iDRAC_CVE%201207_1211_1000116.pdf"
    ],
    "links_original": [
        "http://www.nessus.org/u?6063b726",
        "https://nvd.nist.gov/vuln/detail/CVE-2018-1207"
    ],
    "name": "Dell iDRAC – řada zranitelností (březen 2018)",
    "name_original": "Dell iDRAC Products Multiple Vulnerabilities (Mar 2018)",
    "recommendations": "Aktualizujte firmware iDRAC na poslední stabilní verzi nebo pro odstranění uvedených zranitelností alespoň na verzi 2.52.52.52.",
    "recommendations_original": "Update the iDRAC firmware to 2.52.52.52 or higher.",
    "severity": 4,
    "severity_original": 3,
    "system_impact": 3,
    "system_impact_original": 3
}