{
    "attack_complexicity": 0,
    "attack_complexicity_original": 0,
    "author": "Petr Svoboda",
    "description": "Kontejnery __podu__ nejsou nastaveny, aby spouštěli procesy pod neprivilegovaným uživatelem.",
    "description_original": "runAsUser is set to UID 0 (root user) in the PodSecurityContext. Either set it to a value > 0 or remove it and set runAsNonRoot to true.",
    "impact": "Kompromitací aplikace získává útočník plnou kontrolu na kontejnerem. Spouštění procesů kontejneru pod UID 0 odporuje principu používání nejnižších možných privilegií.",
    "impact_original": "",
    "links": [
        "https://kubernetes.io/docs/tasks/configure-pod-container/security-context/",
        "https://cs.wikipedia.org/wiki/Princip_nejni%C5%BE%C5%A1%C3%ADch_privilegi%C3%AD"
    ],
    "links_original": [],
    "name": "Spouštění procesů kontejnerů pod uživatelem root",
    "name_original": "RunAsUserPSCRoot",
    "recommendations": "Spouštějte procesy kontejneru pod neprivilegovaným uživatelem. V sekci __PodSecurityContext__ buď upravte parametr __runAsUser__ na ID vyšší než 0 nebo parametr zrušte a nastavte parametr __runAsNonRoot__.",
    "recommendations_original": "",
    "severity": 1,
    "severity_original": 2,
    "system_impact": 0,
    "system_impact_original": 0
}