{
    "# comment severity": "0 - info, 1 - low, 2 - medium, 3 - high, 4 - critical",
    "# hodnoty attack_complexicity": "1 - low, 2 - medium, 3 - high",
    "# hodnoty system_impact": "1 - low, 2 - medium, 3 - high",
    "# original description": "The remote host supports the use of SSL ciphers that offer weak encryption.\n\nNote: This is considerably easier to exploit if the attacker is on the same physical network.",
    "attack_complexicity": 1,
    "author": "Peter Šinaľ,lnovy",
    "description": "Konfigurace služby umožňuje připojení prostřednictvím protokolu SSL/TLS za použití šifrovacích sad, které jsou považovány za slabé.",
    "ignore_pluginoutput": "true",
    "impact": "Šifrovací sady, které jsou považovány za slabé, obsahují závažné chyby a komunikace s použitím takových šifer se nedá považovat za zabezpečenou. Útočník je potenciálně schopen provádět odposlech či jinak manipulovat s obsahem zabezpečeného spojení.",
    "links": [
        "http://www.nessus.org/u?6527892d"
    ],
    "name": "SSL/TLS – podpora slabých šifrovacích sad",
    "recommendations": "V konfiguraci služby zakažte použití slabých šifrovacích sad SSL.",
    "severity": 2,
    "system_impact": 0
}