{
    "# original description": "The remote SSH server is configured to allow key exchange algorithms which are considered weak.\n\nThis is based on the IETF draft document Key Exchange (KEX) Method Updates and Recommendations for Secure Shell (SSH) draft-ietf-curdle-ssh-kex-sha2-20. Section 4 lists guidance on key exchange algorithms that SHOULD NOT and MUST NOT be enabled. This includes:\n\n  diffie-hellman-group-exchange-sha1\n\n  diffie-hellman-group1-sha1\n\n  gss-gex-sha1-*\n\n  gss-group1-sha1-*\n\n  gss-group14-sha1-*\n\n  rsa1024-sha1\n\nNote that this plugin only checks for the options of the SSH server, and it does not check for vulnerable software versions.",
    "attack_complexicity": 3,
    "author": "Petr Svoboda,lnovy",
    "description": "SSH server umožňuje použití algoritmů pro výměnu klíče, které jsou ve standardu IETF __Key Exchange (KEX) Method Updates and Recommendations for Secure Shell (SSH) draft-ietf-curdle-ssh-kex-sha2-20__ kapitola 4 označené jako slabé (diffie-hellman-group-exchange-sha1, diffie-hellman-group1-sha1, gss-gex-sha1-*, gss-group1-sha1-*, gss-group14-sha1-*, rsa1024-sha1).\n\nPodporované slabé algoritmy výměny klíče:",
    "impact": "Použití slabého šifrování může útočníkovi umožnit prolomit zašifrovaný datový tok a získat přístupové údaje a další přenášená data.",
    "links": [
        "https://datatracker.ietf.org/doc/html/rfc8732"
    ],
    "name": "SSH – podpora slabých algoritmů výměny klíčů",
    "recommendations": "Zakažte použití výše uvedených slabých algoritmů výměny klíče v konfiguraci SSH serveru (konfigurační direktiva \"__GSSAPIKexAlgorithms__\").",
    "severity": 1,
    "system_impact": 2
}