{
    "# comment severity": "0 - info, 1 - low, 2 - medium, 3 - high, 4 - critical",
    "# hodnoty attack_complexicity": "1 - low, 2 - medium, 3 - high",
    "# hodnoty system_impact": "1 - low, 2 - medium, 3 - high",
    "attack_complexicity": 1,
    "author": "Aleš Ryška",
    "description": "Výše uvedené služby používají pro zabezpečení komunikace mezi serverem a klientem šifrování pomocí SSL protokolu. Server se však při sestavování zabezpečeného spojení představuje nedůvěryhodným certifikátem (například tzv. self-signed certifikátem, tj. certifikátem, jež je podepsán sám sebou nebo případně, že nelze ověřit platnost celého řetězce certifikátů). ",
    "impact": "Skutečnost, že klienti nemají možnost důvěryhodně ověřit certifikát serveru (a tedy jeho autenticitu) zásadním způsobem usnadňuje útoky typu Man-in-the-middle.",
    "links": [
        "https://en.wikipedia.org/wiki/X.509https://www.itu.int/rec/T-REC-X.509/en",
        "https://cheatsheetseries.owasp.org/cheatsheets/Transport_Layer_Protection_Cheat_Sheet.html#Rule_-_Use_an_Appropriate_Certification_Authority_for_the_Application.27s_User_Base"
    ],
    "name": "Nedůvěryhodný SSL certifikát",
    "recommendations": "Nasaďte na server certifikáty od kvalifikované, obecně uznávané, certifikační autority, nebo eventuálně certifikáty vlastní certifikační autority, pokud je server využíván výhradně klienty uvnitř organizace.",
    "severity": 2,
    "system_impact": 1
}