{
    "# comment severity": "0 - info, 1 - low, 2 - medium, 3 - high, 4 - critical",
    "# hodnoty attack_complexicity": "1 - low, 2 - medium, 3 - high",
    "# hodnoty system_impact": "1 - low, 2 - medium, 3 - high",
    "# original description": "The remote host is running a Telnet server over an unencrypted channel.\n\nUsing Telnet over an unencrypted channel is not recommended as logins, passwords, and commands are transferred in cleartext. This allows a remote, man-in-the-middle attacker to eavesdrop on a Telnet session to obtain credentials or other sensitive information and to modify traffic exchanged between a client and server.\n\nSSH is preferred over Telnet since it protects credentials from eavesdropping and can tunnel additional data streams such as an X11 session.",
    "attack_complexicity": 1,
    "author": "Jaroslav Vojtěch,lnovy",
    "description": "Na uvedených adresách byla detekována služba Telnet. Používání služby Telnet se nedoporučuje, protože přihlašovací údaje, hesla, příkazy a veškerá ostatní přenášená data jsou přenášeny ve formě nezašifrovaného textu. To umožňuje útočníkovi schopnému odposlouchávat síťový provoz a zachytit citlivé údaje mezi klientem a serverem.",
    "impact": "Útočník je schopen odposlechnut citlivé údaje, které mohou být zneužity pro přístup k danému serveru nebo jiným systémům.",
    "links": [],
    "name": "Podpora služby Telnet",
    "recommendations": "Zakažte službu Telnet. Jako alternativu lze použít službu SSH.",
    "severity": 2,
    "system_impact": 2
}