{
    "# comment severity": "0 - info, 1 - low, 2 - medium, 3 - high, 4 - critical",
    "# hodnoty attack_complexicity": "1 - low, 2 - medium, 3 - high",
    "# hodnoty system_impact": "1 - low, 2 - medium, 3 - high",
    "# original description": "Many PHP installation tutorials instruct the user to create a PHP file that calls the PHP function 'phpinfo()' for debugging purposes. Various PHP applications may also include such a file. By accessing such a file, a remote attacker can discover a large amount of information about the remote web server, including:\n\n  - The username of the user who installed PHP and if they are a SUDO user.\n\n - The IP address of the host.\n\n - The version of the operating system.\n\n - The web server version.\n\n - The root directory of the web server.\n\n - Configuration information about the remote PHP installation.",
    "attack_complexicity": 1,
    "author": "Petr Svoboda",
    "description": "Na výše uvedené URL byl nalezen výstup z PHP funkce phpinfo() obsahující množství informací o prostředí provozovaného webového serveru. Výstup obsahuje mimo jiné informace o verzi operačního systému, přesné verzi interpreta jazyka PHP, instalovaných rozšířeních, (interní) IP adresu serveru a kořenový adresář webového serveru.",
    "impact": "Vzdálený neautentizovaný útočník může získané informace zneužít k lepšímu zacílení dalších pokusů o průnik do systému. Přesné informace o provozovaných verzích softwaru například umožňují zjištění známých zranitelností, informace o adresářové struktuře webového serveru usnadňují zneužití případných zranitelností webových aplikacích, například typu \"directory traversal\".",
    "links": [
        "https://github.com/AlexisAhmed/OWASP-Testing-Guide-v5/blob/master/document/4%20Web%20Application%20Security%20Testing/4.3%20Configuration%20and%20Deployment%20Management%20Testing/4.3.4%20Review%20Old%2C%20Backup%20and%20Unreferenced%20Files%20for%20Sensitive%20Information%20(OTG-CONFIG-004).md",
        "https://www.php.net/manual/en/function.phpinfo.php"
    ],
    "name": "PHP – informační únik (phpinfo)",
    "recommendations": "Zamezte v přístupu k uvedeným URL nebo skript smažte.",
    "severity": 2,
    "system_impact": 2
}