{
    "# hodnoty attack_complexicity": "1 - low, 2 - medium, 3 - high",
    "# hodnoty severity": "0 - info, 1 - low, 2 - medium, 3 - high, 4 - critical",
    "# hodnoty system_impact": "1 - low, 2 - medium, 3 - high",
    "# original description": "A denial of service (DoS) vulnerability exists in ISC BIND versions 9.11.18 / 9.11.18-S1 / 9.12.4-P2 / 9.13 / 9.14.11 / 9.15 / 9.16.2 / 9.17 / 9.17.1 and earlier. An unauthenticated, remote attacker can exploit this issue, via a specially-crafted message, to cause the service to stop responding.\n\nNote that Nessus has not tested for this issue but has instead relied only on the application's self-reported version number.",
    "attack_complexicity": 2,
    "author": "Václav Chlad,lnovy",
    "description": "Instalovaná verze ISC BIND serveru obsahuje chybu, díky které může útočník pomocí upravené zprávy v rámci komunikace znefunkčnit službu do jeho restartu.",
    "impact": "Vzdálený neautentizovaný útočník je schopen DNS server vyřadit z provozu.",
    "links": [
        "https://cve.mitre.org/cgi-bin/cvename.cgi?name=CVE-2020-8617",
        "https://kb.isc.org/docs/cve-2020-8617"
    ],
    "name": "ISC BIND – DoS (CVE-2020-8617)",
    "recommendations": "Aktualizujte ISC BIND server na aktuální stabilní verzi nebo pro odstranění uvedené zranitelnosti alespoň na verzi 9.11.19, 9.14.12 či 9.16.3.",
    "severity": 3,
    "system_impact": 3
}