{
    "attack_complexicity": 1,
    "attack_complexicity_original": 1,
    "author": "vchlad",
    "description": "Cisco IOS Software na výše uvedené adrese obsahuje chybu v komponentě AutoReconnect, která dovoluje neautentizovanému útočníkovi vyčerpat lokální seznam IP adres.",
    "description_original": "According to its self-reported version, Cisco IOS is affected by a denial of service (DoS) vulnerability in its AutoReconnect feature. An authenticated, remote attacker can exploit this issue to cause a DoS condition by exhausting the free IP addresses from the assigned local pool.\n\nPlease see the included Cisco BIDs and Cisco Security Advisory for more information.\n\nNote that Nessus has not tested for this issue but has instead relied only on the application's self-reported version number.",
    "impact": "Útočník tímto způsobem může způsobit DoS.",
    "impact_original": "",
    "links": [
        "https://tools.cisco.com/security/center/content/CiscoSecurityAdvisory/cisco-sa-ikev2-ebFrwMPr"
    ],
    "links_original": [
        "http://tools.cisco.com/security/center/viewErp.x?alertId=ERP-74581",
        "http://www.nessus.org/u?0ab6fc3e",
        "https://bst.cloudapps.cisco.com/bugsearch/bug/CSCvw25564",
        "https://nvd.nist.gov/vuln/detail/CVE-2021-1620"
    ],
    "name": "Cisco IOS Software - AutoReconnect DoS",
    "name_original": "Cisco IOS Software IKEv2 AutoReconnect Feature DoS (cisco-sa-ikev2-ebFrwMPr)",
    "recommendations": "Aktualizujte software dle doporučení výrobce na odkazu níže.",
    "recommendations_original": "Upgrade to the relevant fixed version referenced in Cisco bug ID CSCvw25564",
    "severity": 1,
    "severity_original": 1,
    "system_impact": 1,
    "system_impact_original": 1
}