{
    "# hodnoty attack_complexicity": "1 - low, 2 - medium, 3 - high",
    "# hodnoty severity": "0 - info, 1 - low, 2 - medium, 3 - high, 4 - critical",
    "# hodnoty system_impact": "1 - low, 2 - medium, 3 - high",
    "# original description": "Nessus has detected that the remote SMTP server is insufficiently protected against mail relaying. This issue allows any spammer to use your mail server to send their mail to the world, thus flooding your network bandwidth and possibly getting your mail server blacklisted.",
    "attack_complexicity": 1,
    "author": "Alexej Demjanenko,lnovy",
    "description": "Konfigurace SMTP serveru akceptuje k odeslání emaily určené pro domény třetí strany (open mail relay).",
    "impact": "Nepříhlášený vzdálený útočník je schopen SMTP server zneužít pro odesílání nevyžádáné pošty na domény třetích stran. To v důsledku může způsobit vyčerpání kapacity internetového připojení a/nebo zařazení IP adresy serveru na blacklisty.",
    "links": [
        "https://cve.mitre.org/cgi-bin/cvename.cgi?name=CVE-1999-0512",
        "https://en.wikipedia.org/wiki/Email_spam"
    ],
    "name": "SMTP – otevřený mail relay",
    "recommendations": "Změnou konfigurace zamezte možnosti zasílat emaily na domény třetí strany.",
    "severity": 3,
    "system_impact": 1
}