{
    "# hodnoty attack_complexicity": "1 - low, 2 - medium, 3 - high",
    "# hodnoty severity": "0 - info, 1 - low, 2 - medium, 3 - high, 4 - critical",
    "# hodnoty system_impact": "1 - low, 2 - medium, 3 - high",
    "attack_complexicity": 2,
    "author": "Peter Šinaľ,lnovy",
    "description": "Na výše uvedené adrese je dostupná služba SSH, která umožňuje přihlášení pomocí zastaralé verze 1 SSH protokolu, jež je z kryptografického hlediska považovaná za nezabezpečenou.",
    "impact": "Zneužitím níže odkazované chyby PKCS#1 v1.5 a časovou analýzou (Timing attack) může útočník získat klíč potřebný k rozšifrování zabezpečené komunikace. ",
    "links": [
        "https://cve.mitre.org/cgi-bin/cvename.cgi?name=CVE-2001-0361",
        "https://www.coresecurity.com/content/ssh-protocol-15-session-key-recovery-vulnerability "
    ],
    "name": "SSH – podpora protokolu verze 1",
    "original_description": "The remote SSH daemon supports connections made using the version 1.33 and/or 1.5 of the SSH protocol. \n\nThese protocols are not completely cryptographically safe so they should not be used.",
    "recommendations": "Zakažte podporu verze 1 služby SSH a používejte pouze SSH ve verzi 2.",
    "severity": 3,
    "system_impact": 3
}