{
    "# comment severity": "0 - info, 1 - low, 2 - medium, 3 - high, 4 - critical",
    "# hodnoty attack_complexicity": "1 - low, 2 - medium, 3 - high",
    "# hodnoty system_impact": "1 - low, 2 - medium, 3 - high",
    "attack_complexicity": 1,
    "author": "Aleš Ryška",
    "description": "Aplikace vyzrazuje informace o použitých technologiích prostřednictvím následujících hlaviček HTTP odpovědí:\n\n",
    "impact": "Útočník je schopen získané informace využít pro lepší zacílení následných útoků.",
    "links": [
        "https://kennel209.gitbooks.io/owasp-testing-guide-v4/content/en/web_application_security_testing/fingerprint_web_server_otg-info-002.html"
    ],
    "name": "Vyzrazení použitých technologií v hlavičkách",
    "recommendations": "Zamezte zasílání hlaviček vyzrazujících použité technologie v hlavičkách HTTP odpovědí.",
    "severity": 2,
    "system_impact": 2
}