{
    "attack_complexicity": 0,
    "attack_complexicity_original": 0,
    "author": "lnovy",
    "description": "Na auditovaném systému není nainstalován nástroj debsums.",
    "description_original": "https://cisofy.com/lynis/controls/PKGS-7370/ (plugin napr. pise: Install debsums utility for the verification of packages with known good database.)",
    "impact": "Nástroj debsums slouží ke sledování integrity nainstalovaných balíčků.",
    "impact_original": "",
    "links": [
        "https://cisofy.com/lynis/controls/PKGS-7370/"
    ],
    "links_original": [],
    "name": "Hardening – chybějící nástroj debsums",
    "name_original": "",
    "recommendations": "Nainstalujte nástroj debsums.",
    "recommendations_original": "",
    "severity": 0,
    "severity_original": 0,
    "system_impact": 0,
    "system_impact_original": 0
}