{
    "# comment severity": "0 - info, 1 - low, 2 - medium, 3 - high, 4 - critical",
    "# hodnoty attack_complexicity": "1 - low, 2 - medium, 3 - high",
    "# hodnoty system_impact": "1 - low, 2 - medium, 3 - high",
    "# original description": "The version of Apache httpd installed on the remote host is prior to 2.4.42. It is, therefore, affected by multiple vulnerabilities as referenced in the 2.4.42 advisory.\n\n  - In Apache HTTP Server 2.4.0 to 2.4.41, mod_proxy_ftp may     use uninitialized memory when proxying to a malicious     FTP server. (CVE-2020-1934)\n\n  - In Apache HTTP Server 2.4.0 to 2.4.41, redirects     configured with mod_rewrite that were intended to be     self-referential might be fooled by encoded newlines and     redirect instead to an an unexpected URL within the     request URL. (CVE-2020-1927)\n\nNote that Nessus has not tested for this issue but has instead relied only on the application's self-reported version number.",
    "attack_complexicity": 2,
    "author": "Jaroslav Vojtěch,lnovy",
    "description": "Server Apache je dle oznamované verze před verzí 2.4.42 a tudíž trpí následujícími bezpečnostními nedostatky:\n - Použití neincializované paměti v modulu mod_proxy_ftp (CVE-2020-1934).\n - Chyba zpracování redirectů v modulu mod_rewrite (CVE-2020-1927).",
    "ignore_pluginoutput": "true",
    "impact": "Vzdálený útočník je schopný dosáhnout odepření služby (CVE-2020-1934) případně se dostat k prostředkům serveru, které nemají být normálně přístupné (CVE-2020-1927).",
    "links": [
        "https://cve.mitre.org/cgi-bin/cvename.cgi?name=CVE-2020-1927"
    ],
    "name": "Apache < 2.4.42 – řada zranitelností",
    "recommendations": "Aktualizujte Apache na verzi 2.4.42 nebo vyšší.",
    "severity": 1,
    "system_impact": 1
}