{
    "attack_complexicity": 0,
    "attack_complexicity_original": 0,
    "author": "Petr Svoboda",
    "description": "It was possible to determine the software that is used as HTTP server from it's responses.",
    "description_original": "This plugin attempts to determine the type and the version of the   remote web server.",
    "impact": "Generally, any information about software can be used by the attacker to better aim further attacks or more easily identify known vulnerabilities.",
    "impact_original": "",
    "links": [],
    "links_original": [],
    "name": "HTTP – Information Disclosure (Server Type and Version)",
    "name_original": "HTTP Server Type and Version",
    "recommendations": "Remove the __Server__ header from server responses to make identifying vulnerabilities more difficult, but note, that this also makes identifying vulnerabilities more difficult during security audits and vulnerabilities still needs to be patched even if information about software is hidden.",
    "recommendations_original": "n/a",
    "severity": 0,
    "severity_original": 0,
    "system_impact": 0,
    "system_impact_original": 0
}