{
    "attack_complexicity": 1,
    "attack_complexicity_original": 1,
    "author": "lnovy",
    "description": "Firmware iDRAC na výše uvedené adrese je nižší než 2.61.60.60 (iDRAC7, iDRAC8) resp. nižší než 3.20.21.20, 3.21.24.22, 3.21.26.22 či 3.23.23.23 (iDRAC9) a tudíž trpící řadou bezpečnostních nedostatků:\n\n - Zranitelnost umožňující eskalaci oprávnění v komponentně rozhraní Redfish (CVE-2018-15774).\n - Chyba zpracování chybových stavů (CVE-2018-15776).",
    "description_original": "The remote host is running iDRAC7 or iDRAC8 with a firmware version prior to 2.61.60.60, or iDRAC9 with a firmware version prior to 3.20.21.20, 3.21.24.22, 3.21.26.22 or 3.23.23.23 and is therefore affected by the following vulnerabilities:\n\n  - An elevation of privilege vulnerability exists in Redfish     interface. An authenticated, attacker can exploit, via a     permissions check flaw, to gain elevated privileges.\n    (CVE-2018-15774)\n\n  - A flaw exists in iDRAC7 / iDRAC8 due to improper handling of     an error. A unauthenticated, remote attacker can exploit this     to gain access to a u-boot shell. (CVE-2018-15776)",
    "impact": "- Přihlášený útočník je schopen eskalovat oprávnění.\n - Nepřihlášený útočník je schopen získat přistup k shellu ḱomponenty u-boot.",
    "impact_original": "",
    "links": [
        "http://www.nessus.org/u?751fcfbd",
        "https://nvd.nist.gov/vuln/detail/CVE-2018-15774"
    ],
    "links_original": [
        "http://www.nessus.org/u?751fcfbd",
        "https://nvd.nist.gov/vuln/detail/CVE-2018-15774"
    ],
    "name": "Dell iDRAC – řada zranitelností (prosinec 2018)",
    "name_original": "Dell iDRAC Products Multiple Vulnerabilities (December 2018)",
    "recommendations": "Aktualizujte firmware iDRAC na poslední stabilní verzi nebo pro odstranění uvedených zranitelností alespoň na verzi 2.61.60.60 (iDRAC7/iDRAC8) resp. 3.20.21.20, 3.21.24.22, 3.21.26.22, 3.23.23.23 (iDRAC9).",
    "recommendations_original": "Update the remote host to iDRAC7/iDRAC8 firmware 2.61.60.60, or iDRAC9 firmware 3.20.21.20, 3.21.24.22, 3.21.26.22, 3.23.23.23 or higher.",
    "severity": 2,
    "severity_original": 2,
    "system_impact": 3,
    "system_impact_original": 3
}