{
    "dev": {
        "port": 5252,
        "host": "",
        "database": {
            "name": "pwndoc",
            "server": "pwndoc-mongo-dev",
            "port": "27017"
        }
    },
    "prod": {
        "port": 4242,
        "host": "",
        "database": {
            "name": "pwndoc",
            "server": "pwndoc-mongo",
            "port": "27017"
        }
    },
    "test": {
        "port": 6262,
        "host": "",
        "database": {
            "name": "pwndoc",
            "server": "pwndoc-mongo-test",
            "port": "27017"
        }
    }
}